program: Gaussian 09
title: 000035177
version: EM64L-G09RevD.01
frameworkgroup: C1[X(C11H5ClN6S2)]
method: RPBEPBE
basis: SDD
operation: Freq
keyword: #p
keyword: freq=noraman
keyword: PBEPBE/SDD
title: #p freq=noraman PBEPBE/SDD
converged: NO YES NO NO
title: Mulliken charges:
elementType: Cl S S N N N N N N C C C C C C C C C C C H H H H H
charge: -0.047988 0.200327 0.202059 -0.408715 -0.090157 -0.096329 -0.036193 0.428650 0.426369 0.475254 -0.440200 -0.307950 0.115131 -0.182434 -0.200819 -0.122673 0.048760 0.088910 -0.733816 -0.734190 0.344391 0.234413 0.319648 0.259372 0.258181
chargesum: 0.00000
title: Mulliken charges with hydrogens summed into heavy atoms:
elementType: Cl S S N N N N N N C C C C C C C C C C C
charge: -0.047988 0.200327 0.202059 -0.064323 -0.090157 -0.096329 -0.036193 0.428650 0.426369 0.475254 -0.205787 0.011697 0.115131 0.076937 0.057362 -0.122673 0.048760 0.088910 -0.733816 -0.734190
polarizability: 4.24161849e+02 3.72780612e+01 3.18888092e+02 -4.36699753e-04 -4.98511695e-01 7.19725136e+01
1716.lowfreq: -6.1773 -2.8900 -0.0014 0.0016 0.0025 2.2224 8.6727 13.6225 25.1148
frequency: 8.6658 13.4783 25.1133 39.5095 56.1870 78.7920 82.3929 121.1829 193.7095 197.3361 212.1707 216.7110 244.4676 308.6715 312.4588 340.5374 370.6258 390.9013 402.4008 413.8399 431.0206 443.4337 448.3741 450.8199 507.6250 559.5600 618.2701 650.1062 668.7875 702.2893 706.5602 709.4516 734.2679 737.4107 797.0653 819.8428 823.0322 848.1208 867.9956 902.2746 943.4926 989.4247 995.0110 1036.9938 1073.3479 1076.7520 1119.3421 1187.9449 1208.9862 1245.8733 1278.9672 1306.3970 1350.4717 1375.1552 1398.2833 1413.2851 1442.2363 1481.2196 1494.1472 1556.2997 1598.7779 1605.8035 2179.3764 2202.3292 3126.6706 3167.1279 3173.8202 3197.3782 3512.5198
redmass: 22.7994 19.7203 13.7660 4.6168 9.6346 11.8621 12.3932 10.2142 11.1572 9.0692 13.0775 13.1078 10.9487 16.5218 5.4846 5.6560 14.4106 11.3865 13.4088 3.0331 12.3868 12.7436 11.3093 12.6398 2.7812 10.2267 7.3693 7.9654 2.2795 7.4572 9.2291 4.4332 2.0933 12.8582 8.9893 1.4327 6.0018 1.3962 10.4296 10.9907 1.3592 1.3120 4.2700 8.8956 4.9484 3.3670 1.3986 1.1208 6.1329 3.5939 2.5707 1.6651 8.8651 7.1989 7.4617 3.9944 8.2475 2.7954 2.5282 5.2952 4.4333 6.2274 12.9050 12.9030 1.0904 1.0914 1.0954 1.0953 1.0753
irintensity: 0.0029 0.0189 0.3568 0.1074 0.3066 0.6766 0.0568 0.0312 0.6863 0.6006 0.0619 0.1687 0.0302 0.1825 2.7267 0.0409 11.5255 1.9131 0.5609 0.0003 9.3253 0.0024 12.7910 0.0786 33.6315 8.8690 1.6073 2.0249 24.0168 0.7182 31.4518 1.1242 21.8923 177.2239 23.2232 58.1395 28.3019 61.7026 6.5315 45.0551 1.6483 2.5706 49.2882 16.9771 36.4298 83.2151 4.6750 2.6401 4.4154 20.3821 61.1725 12.5811 274.3461 162.1653 731.7045 254.2637 1848.8193 33.8509 506.0866 782.8607 177.7656 0.8865 3361.8951 1268.3139 10.2337 1.5948 2.4484 16.0427 58.6776
temp: 298.150 k
press: 1.00000 atm
elementType: 17 16 16 7 7 7 7 7 7 6 6 6 6 6 6 6 6 6 6 6 1 1 1 1 1
symmnumber: 1
zpe: 395921.4 jmol-1
zpe.correction: 0.150799 hartree
zpe.thermalcorrener: 0.168615 hartree
zpe.thermalcorrenthalpy: 0.169560 hartree
zpe.thermalcorrgfe: 0.098789 hartree
zpe.sumelectzpe: -2005.501948 hartree
zpe.sumelectthermal: -2005.484131 hartree
zpe.sumelectthermalent: -2005.483187 hartree
zpe.sumelectthermalfe: -2005.553957 hartree
dipole: 1.3910 -2.3995 -0.0029
dipole: 2.7736
quadrupole: -157.8950 -131.3053 -136.2707
quadrupole: -4.4180 0.0795 -0.2608
quadrupole: -16.0713 10.5184 5.5529 -4.4180 0.0795 -0.2608
hfenergy: -2005.6527461 hartree
pointgroup: C01 [X(C11H5Cl1N6S2)]
dipole: -0.6368514 -0.8853538 0.0359498 debye
dipolederiv: -1.0607028 0.1242147 0.0010302 0.252137 -0.1511147 0.0001995 -0.0050226 0.0011144 -0.0621997 -1.0543219 0.7062595 -0.0155483 0.7325376 -0.4948365 0.0107073 -0.0141281 0.0093289 -0.0058889 -0.012748 -0.0946812 0.0036935 -0.2004306 -1.365789 0.0542599 0.0088944 0.0606102 -0.0051656 -2.2619086 -0.2777604 0.0219413 -0.6596272 -0.4123471 0.0083988 0.0419843 0.0095204 -0.3101135 -2.4606839 0.1720165 0.0118503 0.1735474 -0.7222054 0.0173319 0.0082657 0.0167905 -0.2089801 -1.3690077 -0.5007567 0.0292346 -1.1197746 -1.4288779 0.0542804 0.0526792 0.0511148 -0.1829753 -1.112348 0.651149 -0.0166477 0.3820324 -1.9309555 0.0600794 -0.0046279 0.0577539 -0.1854167 -2.8896583 1.862447 -0.0404077 1.8856621 -1.4824256 0.0333498 -0.0361125 0.0301034 -0.0648566 -0.2376033 -0.2744362 0.0122485 -0.5254595 -3.7835088 0.1483946 0.022452 0.1475974 -0.0703399 1.3566562 0.0001118 -0.0029291 -0.4468774 0.0034997 0.0056474 0.0142859 0.0017439 0.0872134 -0.1886588 0.0014615 0.0014499 -0.004432 0.0763751 -0.0026824 -0.0029234 -0.0021849 -0.1907504 -0.1978123 -0.0212862 0.0009619 0.082707 -0.0320238 -0.0015526 -0.005409 -0.0038962 -0.1418434 2.8610295 0.3667817 -0.0351842 1.2373572 1.1757598 -0.0432229 -0.0595213 -0.0373697 0.2109888 -0.2449931 0.0677909 -0.0000692 0.2529406 0.0129851 -0.0019853 0.0022854 0.0005748 -0.0881841 -0.357652 0.0231009 0.002119 -0.0908132 0.0472905 0.000594 -0.0007308 -0.0014749 -0.09097 1.3375698 -0.248658 0.0014986 -0.3538529 0.1173081 -0.002384 0.005546 -0.0030703 -0.081997 3.1344574 -1.1156299 0.0163705 -0.8793329 2.1943815 -0.062877 0.0060803 -0.0610078 0.2350873 1.6537144 -0.000708 -0.0133159 0.4819013 3.3951925 -0.1226578 -0.0335911 -0.1201914 0.2423082 2.5459077 -1.7395646 0.0365012 -1.7601936 1.184879 -0.0257891 0.0321146 -0.0224309 -0.0271103 0.0246113 0.2712845 -0.0109261 0.477003 3.3841197 -0.1378808 -0.0202255 -0.142917 -0.0235184 0.1773564 -0.0139052 0.000684 0.0889907 0.211087 0.0013373 -0.005313 0.0013072 0.3053001 0.0541358 0.0949607 -0.0018468 0.0722022 -0.0633951 0.001761 -0.0032222 0.0016244 0.1687117 0.2266841 -0.0068016 -0.0032592 -0.0606822 0.0471222 0.0021571 -0.0040243 0.002071 0.1655299 0.005091 -0.0738471 0.0005044 -0.0717887 0.0364453 0.001015 0.0001459 0.0009618 0.1655214 0.070885 0.0264564 0.0000464 0.0542464 -0.0189662 0.0015187 0.000118 0.0023261 0.159649 unknown
polarizability: 415.8948607|-46.8448901|326.8905063|-0.5649492|-8.0335707|72.2370886 unknown
InChI: InChI=1S/C11H5ClN6S2/c12-7-1-3-8(4-2-7)15-11-17-9(13-5-19)16-10(18-11)14-6-20/h1-4,15H
charge 0 multiplicity 1
25 atoms
Cl -6.674583 0.367751 -0.013118
S  6.092369 -3.229743 0.026064
S  1.978787 5.39499 -0.25594
N  -0.865812 -1.334963 0.026916
N  1.437657 -1.501294 0.011603
N  0.385811 0.704444 -0.05165
N  2.823311 0.505993 -0.071828
N  3.763344 -1.629453 -0.003283
N  1.763785 2.579686 -0.136846
C  -2.207543 -0.864946 0.010961
C  -3.227548 -1.855589 0.016948
C  -2.564272 0.509703 -0.004938
C  0.332269 -0.666447 -0.006426
C  -4.586542 -1.487091 0.009269
C  -3.92612 0.877892 -0.013196
C  -4.920847 -0.11837 -0.004892
C  2.634554 -0.858665 -0.02177
C  1.654096 1.217867 -0.083416
C  4.761409 -2.310612 0.009025
C  1.8608 3.783426 -0.184709
H  -0.736281 -2.351188 0.061253
H  -2.963184 -2.920229 0.025317
H  -1.78244 1.269837 -0.015061
H  -5.368519 -2.251433 0.013241
H  -4.204601 1.935533 -0.024524
