program: Gaussian 09
title: 000035142
version: EM64L-G09RevD.01
frameworkgroup: C1[X(C5H5Cl2N3)]
method: RPBEPBE
basis: SDD
operation: Freq
keyword: #p
keyword: freq=noraman
keyword: PBEPBE/SDD
title: #p freq=noraman PBEPBE/SDD
converged: NO NO NO NO
title: Mulliken charges:
elementType: Cl Cl N N N C C C C C H H H H H
charge: 0.042198 0.042231 0.050242 -0.019460 0.013557 -0.463597 0.232504 -0.585090 -0.297231 -0.296221 0.245588 0.245593 0.255196 0.267878 0.266613
chargesum: 0.00000
title: Mulliken charges with hydrogens summed into heavy atoms:
elementType: Cl Cl N N N C C C C C
charge: 0.042198 0.042231 0.050242 -0.019460 0.013557 -0.463597 0.232504 0.161287 -0.029353 -0.029607
polarizability: 1.07536960e+02 -2.51556612e+00 8.62359147e+01 1.01915972e-03 1.09784498e-03 7.19868284e+01
1716.lowfreq: -14.5097 -6.7280 -4.0111 -0.0026 -0.0025 -0.0018 25.4224 88.5005 164.3425
frequency: 25.2032 88.4960 164.3418 226.3948 229.1183 281.0677 284.8066 321.2381 327.9583 376.0271 494.6767 517.7002 638.3066 643.1950 665.4452 809.8181 832.4452 920.0814 938.3462 992.3170 1069.5524 1074.9734 1105.4197 1109.7788 1138.9475 1194.1302 1298.1686 1377.9069 1398.8215 1402.9550 1448.7526 1452.3222 1454.3585 1474.9682 3014.4906 3119.7357 3127.6626 3171.0270 3175.5079
redmass: 6.5383 13.3348 7.6815 14.4478 10.0582 1.0337 4.0132 3.4026 3.3905 8.6737 5.7570 3.9778 6.5467 3.7281 8.8601 3.8006 7.8421 13.4319 1.5412 1.4907 2.8384 1.5291 3.2682 3.3707 10.3366 5.0211 3.9621 1.3145 1.6406 1.3944 1.5236 1.0428 2.2919 3.9060 1.0348 1.1000 1.1018 1.0918 1.0964
irintensity: 0.4292 0.0035 3.5250 0.1132 0.0361 0.0163 0.4895 2.5049 0.8568 2.6205 16.1595 4.1410 35.3179 115.4021 10.2980 1.5335 1.4257 0.9637 6.3678 0.0130 29.2932 51.6826 14.3328 8.4157 2.0277 15.4624 23.8531 30.2369 52.4007 76.4568 21.2455 9.0038 56.3219 127.2974 1.6205 5.7233 8.7980 13.3809 6.4858
temp: 298.150 k
press: 1.00000 atm
elementType: 17 17 7 7 7 6 6 6 6 6 1 1 1 1 1
symmnumber: 1
zpe: 259508.7 jmol-1
zpe.correction: 0.098842 hartree
zpe.thermalcorrener: 0.108297 hartree
zpe.thermalcorrenthalpy: 0.109241 hartree
zpe.thermalcorrgfe: 0.062499 hartree
zpe.sumelectzpe: -1277.143145 hartree
zpe.sumelectthermal: -1277.133689 hartree
zpe.sumelectthermalent: -1277.132745 hartree
zpe.sumelectthermalfe: -1277.179488 hartree
dipole: -1.1606 1.8909 0.0003
dipole: 2.2187
quadrupole: -73.7389 -69.3974 -72.6115
quadrupole: 2.8806 0.0003 0.0002
quadrupole: -1.8230 2.5185 -0.6955 2.8806 0.0003 0.0002
hfenergy: -1277.2419862 hartree
pointgroup: C01 [X(C5H5Cl2N3)]
dipole: -0.3836405 0.7840898 0.0001062 debye
dipolederiv: -0.3114093 0.0655412 0.1636456 0.0783811 -0.2527452 -0.2299896 0.1212873 -0.1711331 -0.5626591 -0.3113619 0.0655495 -0.1636344 0.0783852 -0.2527697 0.2300267 -0.1212714 0.1711655 -0.5625994 -0.8567954 -0.1718154 -0.0000345 -0.3229327 -0.4136006 -0.000021 -0.0000451 -0.0000221 -0.112554 -0.8904509 0.1764579 -0.0000126 0.2095128 -0.4673172 -0.0000101 -0.0000231 -0.0000149 -0.1261188 -0.4799193 0.0137683 -0.0000173 0.0296593 -0.6872512 -0.0000306 -0.000008 -0.0000208 -0.1751456 0.4994038 -0.0237574 -0.0000004 -0.0726445 0.6728546 -0.0000251 0.0000139 -0.0000304 1.2170303 0.9980903 -0.1023082 0.0000166 0.025788 0.2799015 0.0000137 0.0000118 0.0000171 -0.0097606 -0.0901884 -0.0208405 -0.0000014 -0.079077 -0.2097851 -0.0000042 -0.0000049 -0.0000035 -0.115555 0.6077546 0.1000663 0.0000259 0.0839666 0.5957208 0.000026 0.0000255 0.0000272 0.0623365 0.6000145 -0.1237603 0.0000167 -0.1190951 0.5704339 0.0000256 0.0000056 0.0000378 0.0774872 0.1133766 0.0139005 0.0545478 0.0274945 0.0367706 -0.0680812 0.0564543 -0.0569368 -0.0101137 0.1133787 0.0139061 -0.0545457 0.0275023 0.0367658 0.0680799 -0.0564514 0.0569393 -0.0100977 -0.0927929 -0.009051 -0.0000033 0.0280474 0.1039543 -0.0000011 -0.000001 0.0000015 0.1191659 0.0553633 -0.0616781 -0.0000039 -0.0579953 -0.0065046 -0.0000074 -0.0000055 -0.000007 0.1044764 0.0455364 0.064021 0.0000007 0.0630075 -0.0064278 -0.0000016 0.000012 -0.0000198 0.1041076 unknown
polarizability: 106.8660725|-4.4909461|86.9068027|0.0011192|0.0009957|71.9868284 unknown
InChI: InChI=1S/C5H5Cl2N3/c1-5(6,7)4-9-2-8-3-10-4/h2-3H,1H3
charge 0 multiplicity 1
15 atoms
Cl 2.141473 -0.820367 -1.529434
Cl 2.141413 -0.820519 1.529512
N  -0.579761 -1.187969 -0.000058
N  -0.651793 1.235355 0.000071
N  -2.721383 -0.038646 -0.00009
C  1.545576 0.104214 0.000108
C  0.019617 0.043565 0.000043
C  2.148279 1.503352 0.000163
C  -1.942084 -1.165876 -0.000112
C  -2.015732 1.129502 -0.000024
H  1.816593 2.057504 0.893389
H  1.816586 2.057577 -0.893012
H  3.247259 1.426754 0.000163
H  -2.458315 -2.130279 -0.000174
H  -2.58913 2.061133 0.000055
