program: Gaussian 09
title: 000035143
version: EM64L-G09RevD.01
frameworkgroup: C1[X(C6H9N3)]
method: RPBEPBE
basis: SDD
operation: Freq
keyword: #p
keyword: freq=noraman
keyword: PBEPBE/SDD
title: #p freq=noraman PBEPBE/SDD
converged: NO YES NO NO
title: Mulliken charges:
elementType: N N N C C C C C C H H H H H H H H H
charge: -0.024666 -0.035616 0.005479 -0.133274 -0.697252 -0.697253 0.081252 -0.313448 -0.308146 0.242648 0.238449 0.220303 0.222487 0.222493 0.220309 0.238442 0.259763 0.258030
chargesum: 0.00000
title: Mulliken charges with hydrogens summed into heavy atoms:
elementType: N N N C C C C C C
charge: -0.024666 -0.035616 0.005479 0.109374 -0.016012 -0.016010 0.081252 -0.053685 -0.050116
polarizability: 1.03719308e+02 3.07073393e-01 7.90935837e+01 3.02912734e-03 -9.05716713e-03 5.62947482e+01
1716.lowfreq: -16.6647 -12.2526 -0.0007 -0.0006 -0.0006 10.5128 28.5662 107.4370 199.4872
frequency: 28.4522 107.4266 199.4793 221.7396 264.2217 268.8137 300.2128 330.4903 464.3542 564.9138 584.7414 667.0819 757.3741 835.4022 893.1578 923.1241 926.0348 933.9060 963.6755 990.5969 1042.6470 1104.2853 1112.0756 1136.1706 1156.9874 1192.5129 1279.2579 1308.3426 1338.2874 1371.7634 1378.1220 1384.5180 1416.0781 1458.3071 1464.2540 1473.2200 1478.1366 1482.2552 1498.4841 2982.9142 2984.5740 3033.6560 3079.0728 3082.9386 3090.7487 3098.5060 3160.5780 3164.9487
redmass: 3.5190 4.5257 2.5364 1.0326 1.1586 4.1794 2.7641 3.3001 3.2427 2.7250 3.3964 9.1355 4.1387 6.0504 2.6637 9.2689 1.1832 1.5141 1.4984 1.4976 1.8670 2.6991 3.8693 3.8298 2.5537 3.1820 2.1088 1.3087 1.9567 1.1856 1.3282 1.3098 1.8142 4.7599 1.0456 1.0480 1.0601 2.5130 1.2996 1.0343 1.0349 1.0853 1.1007 1.0998 1.1012 1.0998 1.0911 1.0959
irintensity: 0.1095 0.1649 1.3974 0.0103 0.2746 0.0061 1.3552 0.0001 2.3376 9.8629 2.5791 10.4138 12.5468 7.4015 5.9930 6.3508 3.0955 9.8563 0.0011 0.0024 25.7982 0.0413 0.0499 11.7153 1.3861 5.0019 6.5046 0.0124 17.8483 15.2458 31.7130 29.8129 87.6477 79.6380 7.3884 0.8687 11.1421 90.9588 119.2696 33.8187 21.2370 4.9687 19.7828 44.9940 3.1131 46.6309 22.2132 10.3780
temp: 298.150 k
press: 1.00000 atm
elementType: 7 7 7 6 6 6 6 6 6 1 1 1 1 1 1 1 1 1
symmnumber: 1
zpe: 382678.5 jmol-1
zpe.correction: 0.145755 hartree
zpe.thermalcorrener: 0.154413 hartree
zpe.thermalcorrenthalpy: 0.155357 hartree
zpe.thermalcorrgfe: 0.111568 hartree
zpe.sumelectzpe: -397.596664 hartree
zpe.sumelectthermal: -397.588005 hartree
zpe.sumelectthermalent: -397.587061 hartree
zpe.sumelectthermalfe: -397.630851 hartree
dipole: 1.1960 0.0216 0.0000
dipole: 1.1962
quadrupole: -54.9248 -55.2939 -53.5270
quadrupole: 0.0096 -0.0001 0.0006
quadrupole: -0.3429 -0.7120 1.0549 0.0096 -0.0001 0.0006
hfenergy: -397.7424181 hartree
pointgroup: C01[X(C6H9N3)]
dipole: -0.4704729 -0.0112593 0.0000007 debye
dipolederiv: -0.9563489 -0.0714258 0.0000248 -0.1962157 -0.4200769 -0.0001077 -0.0000043 -0.0001384 -0.1459554 -0.8664818 0.1554585 0.0001448 0.3673995 -0.5171618 -0.0001781 0.0002199 -0.0001841 -0.1618103 -0.5166383 -0.0449662 -0.0000085 -0.0512854 -0.7289222 -0.0002593 0.0000183 -0.000242 -0.1677516 -0.2254689 -0.026408 -0.0000278 -0.1745471 0.1238545 0.0000741 -0.0001623 0.0000766 0.0036229 -0.011736 -0.0119197 0.0408187 0.0753096 0.0446364 0.0160402 -0.0815981 0.0445003 0.0055087 -0.0117354 -0.0118761 -0.0408263 0.0752117 0.0447315 -0.0159931 0.0817449 -0.0444478 0.005436 1.2319009 -0.0383912 -0.0000718 -0.101006 0.3480977 0.0001372 -0.0001342 0.0001473 0.0513681 0.6240869 0.084303 -0.0000024 0.0758883 0.5810373 0.0002235 -0.0000025 0.0002422 0.0550675 0.6166296 -0.0535211 -0.0000754 -0.0785451 0.6282641 0.0002833 -0.0001156 0.0003326 0.0408412 0.0610974 -0.0149296 -0.0000073 0.0306799 -0.1161686 -0.0000925 0.0000312 -0.000088 0.0341227 0.1133097 0.0505795 0.0024113 0.0143048 -0.1056183 0.0348254 -0.0024659 -0.023449 0.0805954 -0.1956248 0.0353378 0.0306706 0.0242982 0.093161 0.0182737 0.0183746 0.0141769 0.0761742 0.0720527 -0.0547562 -0.0914393 -0.0387829 0.0463545 -0.0873845 -0.0485393 -0.059261 -0.114899 0.0720699 -0.0548581 0.0913538 -0.0388251 0.0461846 0.0875803 0.0484836 0.0594504 -0.1147305 -0.195629 0.0353808 -0.030601 0.0243156 0.0931951 -0.0182602 -0.0183314 -0.0141642 0.0761411 0.1132889 0.0505814 -0.0023654 0.0142955 -0.1056194 -0.0350539 0.0024718 0.0232255 0.0805783 0.0141114 -0.0855006 -0.0000286 -0.0822317 -0.0043447 -0.0000388 -0.0000486 -0.0000502 0.0982654 0.0611159 0.0569117 0.0000297 0.059736 -0.0516047 -0.0000697 0.0000579 -0.0001272 0.0974252 unknown
polarizability: 103.7148663|0.4512752|79.0980252|-0.0030821|0.0090393|56.2947482 unknown
InChI: InChI=1S/C6H9N3/c1-5(2)6-8-3-7-4-9-6/h3-5H,1-2H3
charge 0 multiplicity 1
18 atoms
N  0.595858 1.296733 0.00059
N  0.206621 -1.097378 -0.00048
N  2.483289 -0.242038 -0.000285
C  -1.738826 0.441208 0.000406
C  -2.376906 -0.163124 1.279403
C  -2.377061 -0.161571 -1.279251
C  -0.242933 0.204985 0.000142
C  1.931675 1.009016 0.000306
C  1.560119 -1.253193 -0.000593
H  -1.881899 1.536731 0.001072
H  -2.197427 -1.251761 1.318177
H  -3.467287 0.015551 1.275275
H  -1.958052 0.293004 2.194657
H  -1.958287 0.295638 -2.194001
H  -3.467435 0.01714 -1.274795
H  -2.197632 -1.250169 -1.319342
H  2.624196 1.856488 0.000674
H  1.946586 -2.27716 -0.001254
