program: Gaussian 09
title: 000035149
version: EM64L-G09RevD.01
frameworkgroup: C1[X(C6H3F6N3)]
method: RPBEPBE
basis: SDD
operation: Freq
keyword: #pfreq=noraman
keyword: PBEPBE/SDD
title: #p freq=noraman PBEPBE/SDD
converged: NO NO NO NO
title: Mulliken charges:
elementType: F F F F F F N N N C C C C C C H H H
charge: -0.127990 -0.138560 -0.138891 -0.127930 -0.138615 -0.138773 0.077202 0.010558 0.013291 -0.045699 -0.047898 0.097535 0.327457 0.327556 -0.732803 0.261697 0.260597 0.261267
chargesum: 0.00000
title: Mulliken charges with hydrogens summed into heavy atoms:
elementType: F F F F F F N N N C C C C C C
charge: -0.127990 -0.138560 -0.138891 -0.127930 -0.138615 -0.138773 0.077202 0.010558 0.013291 -0.045699 -0.047898 0.097535 0.327457 0.327556 0.050757
polarizability: 9.62425047e+01 -2.62018546e-01 1.03960912e+02 1.19229193e-02 7.88968536e-01 5.55895587e+01
1716.lowfreq: -28.5432 -28.0642 -15.9742 -4.7852 -0.0010 -0.0009 0.0006 3.2115 10.9412
frequency: -28.3075 -22.7121 -12.3493 84.2716 107.0743 112.7224 167.1271 180.1831 263.6729 265.8489 269.0985 306.7421 327.1917 368.9315 421.1029 450.3725 469.0602 494.2883 558.3136 567.7890 625.7664 627.2013 649.4950 711.4287 798.3092 845.9117 881.9794 918.5865 982.7657 1021.5491 1023.9130 1051.7456 1058.5295 1061.3818 1090.4849 1137.3530 1168.7192 1320.4811 1334.3150 1389.2284 1411.2768 1441.0882 1448.6451 1477.3879 1485.3692 2998.0843 3089.3873 3136.6442
redmass: 18.9498 8.9211 1.0403 11.3029 15.9718 14.8825 4.8608 6.1469 6.3860 15.4590 17.0647 12.5206 13.6157 8.2156 7.2658 17.3575 13.0069 14.5985 6.6279 9.2297 16.0185 3.9251 14.9704 12.9365 12.2674 9.0484 8.6537 12.7921 2.0724 8.0126 13.0443 1.8798 9.0481 12.0168 11.4691 7.8667 5.7412 8.4514 7.3452 1.6070 2.6651 1.4343 1.3509 3.1883 5.1907 1.0408 1.0913 1.1023
irintensity: 0.0001 0.1140 0.9616 0.9632 0.7406 0.0037 1.8150 0.1133 4.8816 0.2482 0.6319 0.1598 2.6795 0.5201 2.4390 0.0012 5.4230 0.0062 16.8622 0.2234 53.7678 1.4539 7.1487 0.0002 53.6111 9.7144 40.1623 16.7131 16.5644 368.6119 0.2299 86.6765 43.6426 101.1946 250.3399 356.6096 1.9050 78.5277 7.9937 1.3511 122.8924 59.7779 20.1617 34.2473 215.6995 1.1225 4.3208 1.9356
temp: 298.150 k
press: 1.00000 atm
elementType: 9 9 9 9 9 9 7 7 7 6 6 6 6 6 6 1 1 1
symmnumber: 1
zpe: 248828.1 jmol-1
zpe.correction: 0.094774 hartree
zpe.thermalcorrener: 0.106042 hartree
zpe.thermalcorrenthalpy: 0.106986 hartree
zpe.thermalcorrgfe: 0.056865 hartree
zpe.sumelectzpe: -992.613203 hartree
zpe.sumelectthermal: -992.601934 hartree
zpe.sumelectthermalent: -992.600990 hartree
zpe.sumelectthermalfe: -992.651111 hartree
dipole: -0.0241 4.4534 0.0746
dipole: 4.4541
quadrupole: -98.0362 -77.4823 -82.1683
quadrupole: -0.0902 0.0032 0.3202
quadrupole: -12.1406 8.4133 3.7273 -0.0902 0.0032 0.3202
hfenergy: -992.7079762 hartree
pointgroup: C01 [X(C6H3F6N3)]
dipole: -0.0078956 -1.7521712 -0.0252079 debye
dipolederiv: -0.7117163 -0.1959047 0.0016406 -0.1402067 -0.4413164 0.0006712 0.0001683 0.000937 -0.2651751 -0.4092502 0.1298923 0.0568151 0.1138419 -0.4929402 -0.2647779 0.0138826 -0.2219319 -0.6101555 -0.4091812 0.1283985 -0.0557805 0.1121551 -0.4857012 0.2619249 -0.0140526 0.2202342 -0.6174451 -0.7124778 0.1961822 -0.0007426 0.1398911 -0.4413305 -0.0000745 0.0001363 0.0002251 -0.2652208 -0.4089057 -0.1283572 0.0557709 -0.1128065 -0.488094 0.2628292 0.0141949 0.2208204 -0.6148359 -0.4099379 -0.129086 -0.0564066 -0.1139408 -0.4907769 -0.264222 -0.013812 -0.2215017 -0.6129126 -0.9250831 0.0007134 -0.0010612 -0.0006456 -0.4132681 -0.0018478 -0.0011267 0.0039798 -0.0642315 -0.4628227 -0.3344853 -0.0107239 -0.1282124 -0.85911 -0.0042023 -0.0027777 0.0036777 -0.1254294 -0.460118 0.3374326 0.0100638 0.126781 -0.8622617 -0.0033999 0.0027974 0.0035538 -0.1275175 0.553427 -0.0549695 -0.0000568 -0.0487868 0.5092554 0.0028264 0.0055978 -0.0110752 0.0230313 0.5530574 0.0551674 0.0016236 0.0525573 0.5122391 0.003911 -0.0029812 -0.009317 0.0256317 0.3821017 0.0102781 0.0001423 0.0067883 1.3502971 0.032105 0.0000373 0.0661426 0.145883 1.6256575 -0.1087847 -0.0021605 -0.0770098 1.4135849 0.002798 0.0008017 0.0022725 1.4926078 1.626917 0.1075444 0.0010718 0.0784281 1.4139035 0.0019517 -0.0023846 0.0011232 1.4924956 0.0129747 -0.0560916 0.0001443 -0.0110083 -0.4951008 -0.037113 0.0000239 -0.210841 -0.0453132 -0.0074572 0.0392546 -0.068025 0.0022789 0.0880265 0.0111937 -0.0548822 0.0699908 0.1076042 0.0160189 -0.0086687 0.0847913 -0.0002031 0.0895639 0.0139082 0.0689192 0.0779957 0.0874037 0.1467958 0.0114841 -0.0171064 0.0000982 0.0930294 -0.0184819 -0.0145422 0.0037138 -0.0264208 unknown
polarizability: 96.2420114|0.2542479|103.9648528|0.0385306|0.6742016|55.586111 unknown
InChI: InChI=1S/C6H3F6N3/c1-2-13-3(5(7,8)9)15-4(14-2)6(10,11)12/h1H3
charge 0 multiplicity 1
18 atoms
F  -3.579818 -0.055277 -0.000607
F  -2.532566 1.608206 1.124659
F  -2.526821 1.591037 -1.146644
F  3.581523 -0.052008 0.002787
F  2.529464 1.599325 -1.135707
F  2.530461 1.604681 1.135652
N  0.000614 0.723582 0.002962
N  1.211809 -1.375558 0.012615
N  -1.208586 -1.376254 0.012107
C  -1.138045 -0.020435 0.003454
C  1.139702 -0.019312 0.005022
C  0.001936 -2.030553 0.017681
C  -2.450264 0.771358 -0.004309
C  2.451276 0.773631 0.001784
C  0.000016 -3.526947 0.006489
H  0.942705 -3.915563 0.421029
H  -0.863866 -3.914197 0.569825
H  -0.092142 -3.890417 -1.034797
