program: Gaussian 09
title: 000035176
version: EM64L-G09RevD.01
frameworkgroup: C1[X(C11H5ClN6S2)]
method: RPBEPBE
basis: SDD
operation: Freq
keyword: #p
keyword: freq=noraman
keyword: PBEPBE/SDD
title: #p freq=noraman PBEPBE/SDD
converged: NO YES NO NO
title: Mulliken charges:
elementType: Cl S S N N N N N N C C C C C C C C C C C H H H H H
charge: -0.056165 0.200380 0.199633 -0.396138 -0.081480 -0.099207 -0.034790 0.429636 0.426362 0.575212 -0.375493 -0.301489 0.122352 -0.215331 -0.229414 -0.236762 0.045944 0.090138 -0.733294 -0.735736 0.347974 0.322393 0.258848 0.236459 0.239965
chargesum: 0.00000
title: Mulliken charges with hydrogens summed into heavy atoms:
elementType: Cl S S N N N N N N C C C C C C C C C C C
charge: -0.056165 0.200380 0.199633 -0.048164 -0.081480 -0.099207 -0.034790 0.429636 0.426362 0.575212 -0.375493 0.020904 0.122352 0.043517 0.007046 0.003203 0.045944 0.090138 -0.733294 -0.735736
polarizability: 3.65250524e+02 -3.97264208e+01 3.57845823e+02 -1.38079610e-01 9.68228159e-02 7.20634583e+01
1716.lowfreq: -3.9512 -1.1435 -0.0024 -0.0008 0.0015 3.6632 11.5535 15.1953 21.7837
frequency: 11.5428 15.1204 21.7575 33.9978 66.3695 84.9924 91.5964 142.7899 167.8466 189.7083 211.4012 225.7499 237.5677 298.2469 309.5017 348.6815 376.4732 399.0846 403.7508 416.4478 438.6644 442.3297 444.5347 451.7116 537.3453 552.8786 599.7387 664.7727 684.1038 703.7466 709.9978 722.1373 736.5091 761.0620 774.7334 805.1723 823.4182 870.5605 876.8616 903.8247 955.1888 1002.3260 1008.2967 1031.6653 1047.7436 1076.0758 1129.9889 1172.9108 1208.9777 1238.5305 1278.4608 1311.7406 1350.6537 1374.9185 1400.6176 1436.0235 1443.0405 1463.3960 1491.9522 1556.4707 1585.7268 1612.6574 2178.6281 2201.6613 3145.3222 3161.5658 3178.3889 3192.7627 3458.0528
redmass: 20.5648 17.3286 9.6472 10.9337 8.0132 12.9703 9.4563 5.7325 17.7000 8.4887 12.0784 8.8930 11.0138 5.1907 16.5713 8.4871 13.9771 9.7870 12.7514 12.4628 13.2703 3.9942 8.4500 12.5364 3.6208 10.0053 7.4908 7.5739 4.0744 11.0565 9.4233 4.6779 13.2313 1.2142 1.9546 3.6613 6.9216 10.4461 1.3440 10.7266 1.3533 1.3173 7.1403 3.9315 2.7331 10.0216 1.6177 1.0769 5.4044 2.2035 3.4691 2.0786 8.5238 8.5727 8.3738 2.9081 5.7050 2.9023 2.7439 5.3571 4.5773 5.7133 12.9048 12.8992 1.0868 1.0922 1.0982 1.0957 1.0751
irintensity: 0.0047 0.0549 0.4265 0.0152 0.0353 0.1824 1.2916 0.0097 0.7854 0.0075 0.3299 2.7481 0.4603 2.6828 0.1024 1.5554 5.6587 0.6372 0.8144 1.5022 0.7874 7.9558 1.9158 0.3034 2.5979 2.3696 31.7754 35.8205 9.8498 0.2283 11.6977 0.7386 168.9287 47.4851 47.1304 89.7019 16.7972 8.4518 3.6035 51.5763 4.7796 2.7130 50.1866 41.6450 4.1045 30.8356 10.3345 2.4766 1.3117 12.8276 35.2157 31.0240 292.8578 164.9095 1048.3262 476.2812 1117.3102 182.9946 471.9028 657.9211 249.1131 119.6784 3352.3468 1222.3972 2.4613 9.3437 7.1502 23.2807 131.9897
temp: 298.150 k
press: 1.00000 atm
elementType: 17 16 16 7 7 7 7 7 7 6 6 6 6 6 6 6 6 6 6 6 1 1 1 1 1
symmnumber: 1
zpe: 396265.8 jmol-1
zpe.correction: 0.150930 hartree
zpe.thermalcorrener: 0.168669 hartree
zpe.thermalcorrenthalpy: 0.169613 hartree
zpe.thermalcorrgfe: 0.099458 hartree
zpe.sumelectzpe: -2005.502740 hartree
zpe.sumelectthermal: -2005.485000 hartree
zpe.sumelectthermalent: -2005.484056 hartree
zpe.sumelectthermalfe: -2005.554211 hartree
dipole: -3.9260 0.5428 0.0185
dipole: 3.9634
quadrupole: -129.7116 -141.6176 -136.3138
quadrupole: -3.9558 0.0965 0.0593
quadrupole: 6.1694 -5.7366 -0.4328 -3.9558 0.0965 0.0593
hfenergy: -2005.6536694 hartree
pointgroup: C01 [X(C11H5Cl1N6S2)]
dipole: -1.5430364 -0.2239276 0.0196976 debye
dipolederiv: -0.1614773 -0.0540986 0.002942 0.0898257 -0.7176603 -0.0025813 0.0043777 0.0000745 -0.0489371 -0.8533098 -0.7418117 0.0167555 -0.7596858 -0.6643187 0.0149573 0.0135206 0.0116469 -0.0056835 -0.0724564 0.2712045 -0.0027977 0.3493089 -1.3255922 0.0135197 -0.0050215 0.018661 -0.0050197 -2.4425827 0.1230013 0.0336798 0.4894471 -0.4113844 -0.0050777 0.0181848 0.0053647 -0.2924636 -2.3482803 -0.3311265 0.0321213 -0.3857404 -0.7619947 0.0117233 0.0353304 0.0104471 -0.2051312 -1.5354283 0.5339466 0.0117963 1.0332965 -1.2754788 -0.0018589 0.0001685 0.0076896 -0.1813078 -0.9590231 -0.4971518 0.0153333 -0.2770209 -2.0442014 0.0231168 0.0120205 0.0290548 -0.1834249 -2.364545 -1.9362498 0.0448609 -1.9826449 -1.9467358 0.0408366 0.0375531 0.0344443 -0.0644579 -0.3872492 0.731704 -0.0060565 0.9177628 -3.6596945 0.0369758 -0.0096945 0.043682 -0.0645759 1.2785674 0.0487573 -0.0259782 0.6725249 -0.1497162 -0.0128574 -0.0316215 -0.0020107 0.112813 -0.1252582 0.0613011 -0.0013945 -0.1800709 1.0499788 0.0038621 0.0019748 -0.000369 -0.1105685 -0.2505048 0.0810717 0.0012429 -0.2065501 -0.0505152 0.0047286 0.0051086 -0.00425 -0.1413939 3.0697961 -0.2352 -0.0352689 -0.9509708 1.0541079 0.0054258 -0.0257131 -0.0068442 0.2149545 0.0152856 -0.0350093 -0.0027302 -0.1151612 -0.1833768 0.003402 -0.0068807 0.0020916 -0.0813958 -0.0370905 -0.0137811 -0.0047473 0.1273909 0.1316525 0.0001375 -0.0015201 0.0021283 -0.1420609 -0.0698573 0.0271764 -0.0043079 0.0062446 -0.0191307 -0.0012271 -0.0022848 -0.0004881 -0.168173 2.8216224 1.1550969 -0.0459302 0.9842471 2.4439646 -0.0358876 -0.0398378 -0.0383317 0.2340633 1.6754998 -0.2701803 -0.0134621 -0.6507454 3.3374749 -0.0276682 -0.0059623 -0.0357083 0.2373489 2.0571742 1.8216619 -0.0381828 1.8465068 1.6148103 -0.0341482 -0.0313272 -0.0273768 -0.0264004 0.1686203 -0.704779 0.0077154 -0.8524803 3.2697805 -0.0374335 0.0122156 -0.0475561 -0.0291445 0.2936006 -0.0402878 -0.0006066 -0.2124595 0.2605769 0.0034807 0.0031433 -0.0005174 0.2926784 0.2293156 0.0109473 0.0015943 0.0957144 0.0453012 -0.0015677 0.0023078 0.0001721 0.1666064 0.0082818 0.0626853 0.0046655 0.0853979 0.0432911 -0.0029724 0.005169 -0.0024233 0.1656564 0.0749974 -0.0045397 0.0020513 -0.0573321 -0.0877862 -0.0003194 0.0013957 -0.0008997 0.1585718 -0.0856981 -0.0643388 0.0067042 -0.0668056 0.0466472 0.0014333 0.0073932 0.0013185 0.1674459 unknown
polarizability: 364.635546|39.729864|358.3590773|-4.9516139|-2.9214703|72.1651822 unknown
InChI: InChI=1S/C11H5ClN6S2/c12-7-3-1-2-4-8(7)15-11-17-9(13-5-19)16-10(18-11)14-6-20/h1-4,15H
charge 0 multiplicity 1
25 atoms
Cl -3.422012 2.992468 0.142536
S  5.485771 3.761046 -0.025999
S  2.521019 -5.318432 0.11142
N  -1.175962 0.995307 0.066591
N  1.086304 1.453801 0.03887
N  0.329667 -0.869099 0.067056
N  2.720723 -0.358906 0.039398
N  3.37574 1.881223 0.005269
N  1.937638 -2.553214 0.071439
C  -2.436383 0.353105 0.106405
C  -3.604217 1.166948 0.143144
C  -2.616878 -1.05756 0.105577
C  0.098059 0.484457 0.058167
C  -4.898015 0.626421 0.179228
C  -3.91409 -1.608101 0.141605
C  -5.05738 -0.778365 0.178417
C  2.356273 0.970941 0.028073
C  1.653623 -1.21515 0.060167
C  4.277537 2.685747 -0.007836
C  2.189319 -3.735198 0.088433
H  -1.195076 2.023288 0.059708
H  -1.730468 -1.692678 0.080942
H  -5.764798 1.292552 0.208589
H  -4.02806 -2.696985 0.139161
H  -6.062835 -1.209416 0.206039
