program: Gaussian 09
title: 000035159
version: EM64L-G09RevD.01
frameworkgroup: C1[X(C8H12ClN3)]
method: RPBEPBE
basis: SDD
operation: Freq
keyword: #p
keyword: freq=noraman
keyword: PBEPBE/SDD
title: #p freq=noraman PBEPBE/SDD
converged: YES YES NO NO
title: Mulliken charges:
elementType: Cl N N N C C C C C C C C H H H H H H H H H H H H
charge: -0.097665 -0.061540 -0.020469 -0.034379 -0.450349 -0.340663 0.025650 -0.588416 0.048630 0.027217 -0.750546 -0.746097 0.258078 0.246239 0.220163 0.230953 0.297380 0.262076 0.252008 0.241996 0.241953 0.250582 0.242906 0.244292
chargesum: 0.00000
title: Mulliken charges with hydrogens summed into heavy atoms:
elementType: Cl N N N C C C C C C C C
charge: -0.097665 -0.061540 -0.020469 -0.034379 0.053968 0.110454 0.025650 -0.028960 0.048630 0.027217 -0.014588 -0.008318
polarizability: 1.34986189e+02 -2.40875077e-01 1.21625905e+02 7.25637344e+00 1.94351271e+00 8.28276035e+01
1716.lowfreq: -8.2006 -0.0022 -0.0009 -0.0002 4.6628 9.0465 19.2336 39.7333 48.2190
frequency: 19.0621 39.7153 48.2002 51.1281 109.2326 144.7762 169.7111 174.6615 201.2804 231.6673 280.1807 344.1482 414.7879 478.9197 545.5268 556.6160 573.0584 582.1186 587.0396 633.9644 775.0591 812.3438 866.6431 905.6640 921.0863 940.4941 971.5779 1002.5162 1030.3944 1037.7849 1046.3931 1057.5409 1117.2889 1125.9598 1166.7058 1175.4898 1261.9073 1278.2994 1301.3382 1326.8740 1356.8369 1363.9080 1384.5494 1393.1464 1420.2503 1431.3806 1438.9658 1441.3588 1454.7918 1456.3910 1456.8878 1458.1943 1487.3481 1495.2975 2991.7430 2993.2612 2997.7276 2999.0920 3040.0733 3055.1558 3067.0132 3079.1488 3080.2288 3135.2219 3135.6982 3153.4755
redmass: 4.4688 6.2346 1.0393 1.0480 4.0257 4.7676 5.6493 3.9197 2.6609 2.6881 2.4485 2.3660 2.4899 3.3732 4.6741 4.2277 3.9606 3.0943 4.0570 4.0775 2.2855 2.1894 3.3142 2.2857 12.1840 3.2566 1.8193 1.9168 2.1612 1.9752 1.7104 1.6628 1.6580 1.8196 2.1754 1.3906 1.2148 1.8304 1.4862 4.4576 1.9825 1.5532 1.4542 1.3101 2.5177 1.3600 1.1487 1.4344 1.0530 1.0548 1.0950 1.3372 2.9746 2.6951 1.0602 1.0642 1.0382 1.0379 1.0963 1.0933 1.0639 1.0961 1.0963 1.1000 1.1002 1.1104
irintensity: 0.5269 1.0840 0.2415 1.5255 2.2547 0.9617 0.1135 1.3573 8.3964 3.6507 3.7086 8.0390 0.7524 1.8007 6.5352 9.0286 5.5883 0.8004 12.6004 10.7321 12.7566 27.9170 14.9166 6.0050 0.0472 2.7802 8.3391 1.2412 0.7968 1.6607 15.4375 0.0772 2.3780 5.0747 1.9055 0.8309 7.4102 16.5010 9.0945 8.4999 3.9925 8.4507 8.9448 54.5096 4.4723 216.6550 19.6021 223.4248 28.2661 11.6637 12.5195 20.8405 163.7039 190.4773 21.7855 11.8889 3.7191 2.9450 7.4018 16.0047 23.8375 8.2235 9.5594 7.2878 12.1469 13.5690
temp: 298.150 k
press: 1.00000 atm
elementType: 17 7 7 7 6 6 6 6 6 6 6 6 1 1 1 1 1 1 1 1 1 1 1 1
symmnumber: 1
zpe: 502876.0 jmol-1
zpe.correction: 0.191535 hartree
zpe.thermalcorrener: 0.204627 hartree
zpe.thermalcorrenthalpy: 0.205571 hartree
zpe.thermalcorrgfe: 0.148956 hartree
zpe.sumelectzpe: -935.461802 hartree
zpe.sumelectthermal: -935.448710 hartree
zpe.sumelectthermalent: -935.447766 hartree
zpe.sumelectthermalfe: -935.504382 hartree
dipole: -1.5583 1.3767 1.6135
dipole: 2.6319
quadrupole: -84.3661 -75.1757 -77.7066
quadrupole: 4.2758 5.8126 -0.2207
quadrupole: -5.2833 3.9071 1.3762 4.2758 5.8126 -0.2207
hfenergy: -935.6533372 hartree
pointgroup: C01 [X(C8H12Cl1N3)]
dipole: 0.4405514 -0.2959128 0.8891468 debye
dipolederiv: -0.318309 0.0073167 -0.1403841 0.0358279 -0.2260086 0.0985606 -0.2110422 0.0270043 -0.5449435 -0.7546905 0.3053758 -0.0255704 0.3480216 -0.9016673 0.1931127 -0.0433503 0.1844716 -0.2150061 -1.226538 0.032661 0.128029 0.018655 -0.4402759 0.0734998 0.189429 0.0699116 -0.2146258 -0.6695418 -0.2281337 0.1265256 -0.2425536 -0.8994797 0.2599804 0.1705344 0.2588667 -0.2768531 -0.1254717 0.0856265 -0.0031812 0.2733661 -0.1242202 0.0078663 -0.0970548 0.0246987 0.0108359 0.0861054 -0.0336335 -0.0269778 0.0154636 0.0244591 0.0391555 -0.0856105 -0.0089264 -0.0757384 1.1106804 -0.2659594 -0.032159 -0.3310357 0.6147042 -0.113605 -0.0688622 -0.1234573 0.1254646 0.2614039 -0.0293803 0.1903023 -0.0712444 0.1784163 -0.1223666 0.2979317 -0.1359035 0.6811321 0.6051365 -0.0311365 -0.057183 -0.1119028 1.095113 -0.3108983 -0.0559388 -0.2815845 0.1915286 1.0645991 0.2176308 -0.2108256 0.2239146 0.6531495 -0.2020693 -0.2403034 -0.2052974 0.1962595 0.0388617 -0.1385964 0.0323415 0.0008024 -0.3894531 0.1136774 -0.0093569 0.1018072 -0.0417051 -0.3995685 -0.2054642 0.1203159 -0.074272 0.0090443 0.0053986 0.0764073 0.0224618 -0.0324662 0.0540649 0.0435253 0.0089459 -0.0077906 0.1174552 0.0442228 0.0635533 0.0655675 -0.009469 -0.0130912 -0.0295315 -0.0247849 -0.0710191 -0.0110647 -0.0929159 0.0178957 -0.1096044 0.0540382 0.1059347 -0.0048283 -0.0871265 -0.0765327 0.0366644 0.0370049 -0.0584993 0.0683566 -0.0899986 -0.1053898 0.090065 0.0420737 0.0918177 -0.0271629 -0.074839 0.0240018 -0.0226756 0.1016278 0.0850269 0.1059276 0.0294003 0.1097482 0.0024558 -0.000295 0.025087 0.0094635 -0.0238856 -0.0923359 -0.0861884 0.0002294 -0.0852183 0.0278688 0.0596213 0.0065683 0.0776735 -0.0319869 -0.0689233 0.1061251 -0.0166993 0.0223068 0.0810644 0.0121802 0.012726 0.0074565 0.1180063 0.0863403 0.0284533 0.0828567 0.0136858 0.0845049 -0.0018602 0.0656762 0.0438852 -0.0515983 0.0574693 -0.040972 -0.0924251 -0.0399418 0.02915 -0.0398839 -0.0769876 -0.0751602 0.03233 0.0961734 0.0749742 -0.0194567 -0.0108109 -0.0644633 0.0621539 0.0092995 0.0498523 0.1025894 0.0322552 -0.0207844 -0.0816204 -0.0388278 0.0949498 0.0370201 -0.1047786 0.0025086 -0.0066609 0.0898083 0.0169273 0.0573738 0.0075402 0.034796 -0.0847212 0.0926745 -0.0513765 0.001125 unknown
polarizability: 135.7327595|-1.6775891|114.9606275|0.7789364|-15.2552735|88.7463107 unknown
InChI: InChI=1S/C8H12ClN3/c1-6-10-7(2)12-8(11-6)4-3-5-9/h3-5H2,1-2H3
charge 0 multiplicity 1
24 atoms
Cl -3.710958 0.427604 -1.92694
N  -0.070574 -0.536916 0.561223
N  1.030036 1.465167 -0.243115
N  2.317841 -0.550652 0.152681
C  -1.387281 1.54266 0.17228
C  -2.623397 0.770553 0.669982
C  -0.086297 0.770782 0.165237
C  -3.124071 -0.320142 -0.27682
C  1.157427 -1.159471 0.539222
C  2.204441 0.767116 -0.234255
C  1.212275 -2.60091 0.964267
C  3.46062 1.469346 -0.668846
H  -1.564436 1.923637 -0.853059
H  -1.225626 2.446419 0.791125
H  -2.384513 0.271197 1.630241
H  -3.441062 1.488731 0.865049
H  -2.334714 -1.035404 -0.543405
H  -4.008725 -0.839949 0.119751
H  2.252191 -2.958058 0.965635
H  0.770923 -2.721005 1.969409
H  0.611458 -3.223877 0.276549
H  3.236463 2.501642 -0.973789
H  4.196312 1.475211 0.155495
H  3.930068 0.92402 -1.507019
