program: Gaussian 09
title: 000035138
version: EM64L-G09RevD.01
frameworkgroup: C1[X(C4H4ClN3)]
method: RPBEPBE
basis: SDD
operation: Freq
keyword: #p
keyword: freq=noraman
keyword: PBEPBE/SDD
title: #p freq=noraman PBEPBE/SDD
converged: NO NO NO NO
title: Mulliken charges:
elementType: Cl N N N C C C C H H H H
charge: -0.034316 -0.008678 -0.008673 0.009829 0.176954 -0.668454 -0.286648 -0.286648 0.288036 0.288038 0.265280 0.265280
chargesum: 0.00000
title: Mulliken charges with hydrogens summed into heavy atoms:
elementType: Cl N N N C C C C
charge: -0.034316 -0.008678 -0.008673 0.009829 0.176954 -0.092380 -0.021368 -0.021368
polarizability: 8.99260074e+01 -1.86064855e-04 6.43333782e+01 -2.42717087e+00 1.44569457e-04 4.56395179e+01
1716.lowfreq: 0.0026 0.0036 0.0038 7.3668 7.3950 21.5035 55.3211 93.8273 228.6014
frequency: 55.3148 93.8227 228.6011 325.8348 336.0133 489.8646 587.3619 656.3309 666.1642 814.9031 847.1224 902.3308 922.9317 934.9041 988.5506 1083.4165 1109.5866 1153.7520 1233.1988 1260.7054 1299.2942 1377.5198 1408.5142 1433.9673 1458.6331 1479.4106 3092.9423 3170.2768 3174.5165 3189.6943
redmass: 5.2751 13.1559 13.3118 3.0889 2.5566 4.4055 5.9810 4.9779 8.7963 5.1992 7.7584 1.6647 12.8903 1.5617 1.4953 1.7109 3.8523 4.5526 2.1757 1.2210 2.6953 1.3331 1.7062 1.3167 5.6749 4.3606 1.0558 1.0916 1.0965 1.1132
irintensity: 1.0437 1.0999 1.7383 0.9183 4.9050 0.6195 29.5219 38.0568 10.5322 1.0945 5.0230 0.0568 0.0504 6.8167 0.0013 1.5598 0.2579 0.1715 8.5959 6.0264 14.4985 32.7117 60.5565 24.4196 78.3439 134.3382 7.8287 15.9944 6.6238 0.3702
temp: 298.150 k
press: 1.00000 atm
elementType: 17 7 7 7 6 6 6 6 1 1 1 1
symmnumber: 1
zpe: 213984.9 jmol-1
zpe.correction: 0.081503 hartree
zpe.thermalcorrener: 0.088317 hartree
zpe.thermalcorrenthalpy: 0.089262 hartree
zpe.thermalcorrgfe: 0.048914 hartree
zpe.sumelectzpe: -778.531491 hartree
zpe.sumelectthermal: -778.524676 hartree
zpe.sumelectthermalent: -778.523732 hartree
zpe.sumelectthermalfe: -778.564080 hartree
dipole: 1.0071 -0.0001 1.5415
dipole: 1.8413
quadrupole: -57.6406 -53.4390 -51.0805
quadrupole: 0.0001 -2.1283 -0.0002
quadrupole: -3.5872 0.6144 2.9729 0.0001 -2.1283 -0.0002
hfenergy: -778.6129936 hartree
pointgroup: C01 [X(C4H4Cl1N3)]
dipole: -0.3453622 -0.0000786 -0.6368063 debye
dipolederiv: -0.4598573 0.0000051 -0.0904948 -0.0000114 -0.1289723 -0.0000207 -0.1992274 -0.0000135 -0.3004628 -0.7932357 -0.1411929 0.0988962 -0.2254213 -0.4614626 0.0063099 0.1615404 0.0250453 -0.1627372 -0.7931892 0.14125 0.098885 0.2255108 -0.4615109 -0.0062467 0.1614803 -0.0250126 -0.1627287 -0.4383382 -0.0000122 0.0355656 -0.0000173 -0.7073762 0.0000459 0.0597493 0.0000594 -0.1746364 0.9456539 -0.0000308 -0.0313505 -0.000044 0.4014231 -0.0000503 -0.0664722 -0.0000435 0.0059117 0.250753 0.0000194 0.1544052 0.000013 0.1597992 0.0000285 0.150225 0.000032 0.4011726 0.5435108 0.1034397 -0.0966621 0.0984964 0.5908325 -0.0027265 -0.1169637 -0.0279903 0.086043 0.5434803 -0.1034371 -0.0966438 -0.0985111 0.5908616 0.0026282 -0.116975 0.027942 0.0860379 0.0455461 0.0037328 -0.044604 -0.0441239 0.0205708 0.0806574 -0.0285897 0.0483886 0.0085078 0.0455581 -0.0037538 -0.0446162 0.0441148 0.0205274 -0.0806538 -0.0286062 -0.0483883 0.0085482 0.0550467 -0.0656565 0.0083197 -0.0628826 -0.012336 0.0121817 0.0119113 0.0166726 0.1021708 0.0550716 0.0656363 0.0082998 0.0628767 -0.0123566 -0.0121535 0.011928 -0.0166919 0.1021731 unknown
polarizability: 90.0256579|-0.0008369|64.333378|1.2116336|-0.0018509|45.5398675 unknown
InChI: InChI=1S/C4H4ClN3/c5-1-4-7-2-6-3-8-4/h2-3H,1H2
charge 0 multiplicity 1
12 atoms
Cl 2.954113 -0.000026 0.877268
N  -0.143856 -1.216262 -0.214622
N  -0.143702 1.216207 -0.214877
N  -2.179097 0.000158 0.333124
C  0.477399 -0.000082 -0.363904
C  1.934541 -0.000219 -0.72149
C  -1.463378 -1.14926 0.131668
C  -1.463254 1.149443 0.131354
H  2.220493 0.916952 -1.250296
H  2.220382 -0.91759 -1.250008
H  -1.993112 -2.096342 0.270328
H  -1.992829 2.096622 0.269954
