program: Gaussian 09
title: 000005597
version: EM64L-G09RevD.01
frameworkgroup: C1[X(C15H22N2O4)]
method: RPBEPBE
basis: SDD
operation: Freq
keyword: #p
keyword: freq=noraman
keyword: PBEPBE/SDD
title: #p freq=noraman PBEPBE/SDD
converged: YES YES NO NO
title: Mulliken charges:
elementType: O O O O N N C C C C C C C C C C C C C C C H H H H H H H H H H H H H H H H H H H H H H
charge: -0.276184 -0.285274 -0.307806 -0.309252 -0.283644 -0.423864 0.032174 -0.474716 -0.362739 -0.465039 -0.407523 0.131126 0.381075 -0.549488 -0.550968 0.256069 0.272516 0.044227 -0.523498 -0.527753 -0.524338 0.264844 0.229682 0.180383 0.192757 0.215503 0.269149 0.163225 0.171479 0.214797 0.269161 0.307483 0.246139 0.297564 0.259138 0.217445 0.230647 0.224118 0.253256 0.230165 0.228687 0.234243 0.255036
chargesum: 0.00000
title: Mulliken charges with hydrogens summed into heavy atoms:
elementType: O O O O N N C C C C C C C C C C C C C C C
charge: -0.276184 -0.285274 -0.307806 -0.309252 -0.014483 -0.116380 0.297017 -0.064651 0.045522 -0.032665 -0.021247 0.131126 0.381075 -0.303350 -0.253404 0.256069 0.272516 0.044227 0.183732 0.179786 0.193627
polarizability: 2.73958635e+02 -2.31719539e+00 1.96814423e+02 7.55929064e+00 1.79137976e+00 1.27097745e+02
1716.lowfreq: -9.7807 -6.5984 -0.0005 -0.0002 0.0008 1.6921 26.9576 31.8347 44.5077
frequency: 26.1097 31.5637 44.3076 59.7680 69.1696 72.6710 83.8816 95.5968 117.9564 139.6238 151.7503 162.2996 167.5974 178.1159 195.7631 214.5027 228.4733 242.6934 246.3938 281.2460 320.6274 333.0922 353.2969 358.2288 376.0891 417.4092 419.9136 438.2728 466.1108 495.1860 520.9133 531.9844 547.7620 581.5352 613.7101 632.6641 654.1810 673.8090 742.5164 760.1687 775.7259 821.4166 862.1072 865.9100 867.8831 878.9431 890.6694 921.9515 938.3042 941.1401 954.3728 978.3778 998.4898 1034.5904 1064.6243 1068.3098 1102.7849 1110.4604 1111.5139 1113.5160 1113.9482 1139.0197 1142.3360 1149.0938 1153.2370 1158.3553 1169.3587 1172.9677 1201.6413 1213.9325 1236.0993 1266.3286 1270.7206 1279.6003 1304.5882 1314.7161 1329.0396 1341.1954 1350.4502 1359.0808 1381.4737 1389.2891 1414.3216 1434.7774 1435.4435 1443.4896 1449.7216 1457.9714 1458.8222 1459.5033 1461.6869 1465.7966 1468.0023 1476.3332 1479.9149 1483.2192 1484.1478 1487.5206 1557.4417 1593.1824 1602.9310 2832.0808 2839.4796 2945.2380 2975.4161 2976.4404 2978.9465 2992.3096 3024.7016 3037.7149 3041.7838 3058.5141 3066.5481 3074.6485 3079.5683 3082.3961 3123.2971 3123.5069 3126.9166 3147.9017 3175.7407 3482.9866 3541.5418
redmass: 4.2486 3.8283 4.3154 3.8046 4.0277 3.4473 2.7577 2.8991 2.8881 2.5097 1.2278 1.4464 1.1279 3.4757 4.2551 3.1844 4.0439 2.0120 4.8096 5.5282 4.5164 4.3106 5.0209 2.2394 6.1540 2.8136 6.0311 2.6313 2.6533 2.8760 5.3111 1.3259 2.6466 4.4682 3.6723 2.9835 3.1989 4.1387 4.3709 5.0815 4.6959 2.5532 1.5902 4.6171 2.1018 2.0973 3.5407 1.5830 3.8051 3.7489 2.4262 1.7978 3.8202 6.3297 1.7260 2.3738 2.3623 1.8399 1.2649 1.3880 1.5082 1.6062 1.8363 1.3926 1.3746 1.4632 2.5900 2.8611 1.4818 1.3989 1.7228 1.3010 1.2889 1.5163 1.5890 1.9054 1.2673 1.4154 1.6373 7.2833 1.4264 2.8032 1.3298 1.2293 1.4395 1.3266 1.7643 1.0550 1.0991 1.0772 1.1819 1.1034 1.0765 1.0591 1.1055 1.5721 1.1407 1.2313 7.6511 7.9566 6.9820 1.0715 1.0696 1.0650 1.0314 1.0325 1.0298 1.0614 1.0894 1.0880 1.0902 1.1028 1.0904 1.1030 1.1056 1.1000 1.1033 1.1031 1.1041 1.0915 1.0920 1.0759 1.0772
irintensity: 1.7775 1.1775 0.9575 0.5221 8.2755 1.4427 3.5203 6.1364 1.9638 3.2039 1.1037 1.9124 0.4182 1.9353 4.7839 8.6087 8.0630 1.5019 12.6113 12.6049 2.6437 4.0759 2.4312 1.9928 3.6734 29.4521 11.1540 5.9592 6.8232 20.3997 1.9452 62.6299 92.5743 8.2576 14.6795 10.7324 18.4091 23.7926 22.4616 2.0061 5.3747 1.2425 9.4910 4.7683 4.3457 10.1245 26.3607 32.6459 55.2111 33.8370 17.7990 33.4182 34.1222 170.3537 11.9368 17.0422 5.9133 18.1955 12.4699 7.9351 4.1135 2.8611 2.3379 3.7815 4.4161 16.8281 32.6925 58.7205 14.7274 6.6612 16.5643 18.8298 3.9475 26.1593 75.7075 214.9147 12.0172 5.2645 16.2477 22.0318 1.8834 39.9048 22.4335 31.1048 17.7098 4.5018 182.1758 18.8490 12.4355 1.7756 43.7875 6.9239 0.7106 0.2829 10.4185 264.1537 47.8248 35.5927 175.7675 64.5057 4.1133 53.0647 174.7144 38.7288 51.5900 115.8709 53.8387 33.1655 24.7337 56.9531 42.1654 48.4535 14.7999 26.1428 19.1564 31.4842 20.9441 24.8789 16.6796 3.8471 3.1137 0.6710 11.9155
temp: 298.150 k
press: 1.00000 atm
elementType: 8 8 8 8 7 7 6 6 6 6 6 6 6 6 6 6 6 6 6 6 6 1 1 1 1 1 1 1 1 1 1 1 1 1 1 1 1 1 1 1 1 1 1
symmnumber: 1
zpe: 930852.7 jmol-1
zpe.correction: 0.354543 hartree
zpe.thermalcorrener: 0.376777 hartree
zpe.thermalcorrenthalpy: 0.377722 hartree
zpe.thermalcorrgfe: 0.301971 hartree
zpe.sumelectzpe: -993.530197 hartree
zpe.sumelectthermal: -993.507963 hartree
zpe.sumelectthermalent: -993.507019 hartree
zpe.sumelectthermalfe: -993.582769 hartree
dipole: 1.6079 4.3457 1.5537
dipole: 4.8872
quadrupole: -96.3906 -127.1818 -122.8271
quadrupole: -2.2856 -8.8087 -4.5963
quadrupole: 19.0759 -11.7153 -7.3606 -2.2856 -8.8087 -4.5963
hfenergy: -993.8847402 hartree
pointgroup: C01 [X(C15H22N2O4)]
dipole: 0.6250181 -1.7271645 -0.5685889 debye
polarizability: 273.4592798|2.3384862|196.8724216|-11.3515423|-0.6810528|127.5391019 unknown
InChI: InChI=1S/C15H22N2O4/c1-19-12-7-10(8-13(20-2)14(12)21-3)15(18)17-11-5-4-6-16-9-11/h7-8,11,16-17H,4-6,9H2,1-3H3
charge 0 multiplicity 1
43 atoms
O  -1.535969 1.926557 0.745835
O  3.36341 2.372215 -0.568274
O  2.534595 -2.504957 -0.225058
O  4.383412 -0.329569 -0.70011
N  -5.62697 0.972413 -0.699204
N  -2.107717 -0.20026 0.001822
C  -3.555853 -0.007819 0.206941
C  -4.264128 -1.378219 0.304691
C  -5.795933 -1.201272 0.439657
C  -4.179782 0.837341 -0.937649
C  -6.346231 -0.316125 -0.700635
C  -1.182484 0.785186 0.305754
C  0.266914 0.433794 0.075495
C  0.74424 -0.90129 0.051364
C  1.17865 1.502566 -0.08039
C  2.547521 1.256939 -0.318815
C  2.11184 -1.155683 -0.169954
C  3.022307 -0.084936 -0.403434
C  4.611861 2.489177 0.217812
C  3.538699 -2.88958 0.7954
C  4.601785 -0.981089 -2.017079
H  -3.692362 0.561491 1.144228
H  -3.86082 -1.953432 1.15962
H  -4.049128 -1.961504 -0.618225
H  -6.294251 -2.189447 0.425207
H  -6.029217 -0.715557 1.405904
H  -3.709417 1.835152 -0.939843
H  -3.939251 0.331325 -1.909766
H  -6.231937 -0.870217 -1.669495
H  -7.424535 -0.126672 -0.548718
H  -6.069127 1.696864 -1.274966
H  -1.797526 -1.052968 -0.467548
H  0.097294 -1.761786 0.250732
H  0.816359 2.532696 -0.022741
H  5.269964 1.621735 0.045883
H  4.373205 2.582086 1.294729
H  5.085563 3.415766 -0.140142
H  3.10736 -2.784389 1.808862
H  4.448874 -2.270434 0.7069
H  3.768242 -3.946833 0.593413
H  5.689836 -1.127733 -2.094415
H  4.2488 -0.31757 -2.827427
H  4.074911 -1.950959 -2.059166
