program: Gaussian 09
title: 000035147
version: EM64L-G09RevD.01
frameworkgroup: C1[X(C5H4Cl3N3)]
method: RPBEPBE
basis: SDD
operation: Freq
keyword: #p
keyword: freq=noraman
keyword: PBEPBE/SDD
title: #p freq=noraman PBEPBE/SDD
converged: NO NO NO NO
title: Mulliken charges:
elementType: Cl Cl Cl N N N C C C C C H H H H
charge: 0.114841 0.138784 0.115054 -0.003186 0.050417 -0.009644 0.272849 0.081088 -0.745406 -0.731177 -0.309738 0.252387 0.255462 0.251992 0.266279
chargesum: 0.00000
title: Mulliken charges with hydrogens summed into heavy atoms:
elementType: Cl Cl Cl N N N C C C C C
charge: 0.114841 0.138784 0.115054 -0.003186 0.050417 -0.009644 0.272849 0.081088 -0.745406 0.028664 -0.043459
polarizability: 1.19321360e+02 -5.69969946e+00 1.07002536e+02 -5.36587418e-01 4.47923378e-01 7.47801343e+01
1716.lowfreq: -24.0094 -5.3827 -0.0017 -0.0017 0.0005 7.6463 10.5988 14.2663 89.2661
frequency: -23.8412 13.8237 89.2327 135.6793 167.8815 204.0634 212.8928 237.9481 281.1946 307.1951 379.7042 413.8257 419.9428 555.4838 600.4308 664.9477 709.1638 738.9095 812.5409 833.7020 917.6048 927.9068 966.9565 1008.7062 1052.6735 1158.1659 1213.0526 1250.2643 1346.2781 1392.2739 1402.7729 1434.8036 1445.5843 1472.3447 1481.4651 2996.9356 3088.6287 3138.6358 3173.6537
redmass: 1.0181 6.5628 14.3929 9.8815 5.0158 9.4610 20.2511 17.6064 18.5380 6.7279 28.5270 3.7800 3.1894 6.3083 5.8811 11.1860 5.4897 9.6024 8.0042 8.3772 12.5296 3.4573 1.5167 2.4418 1.6849 6.5861 6.2318 3.4671 3.4912 1.4083 1.7216 1.9157 1.2393 1.6704 4.5196 1.0417 1.0900 1.1025 1.0941
irintensity: 0.8259 0.0061 0.0288 0.1653 1.8557 1.9264 0.0208 0.6412 0.3699 1.4529 0.2047 4.2733 1.7857 13.5164 50.1377 49.2430 120.4130 120.4402 35.6451 3.1960 0.9412 6.6900 0.5974 2.1894 18.5476 1.0856 16.1792 1.4405 2.9687 37.1532 133.6392 128.1744 35.2552 21.3716 235.2518 0.2910 7.4639 3.7421 9.9980
temp: 298.150 k
press: 1.00000 atm
elementType: 17 17 17 7 7 7 6 6 6 6 6 1 1 1 1
symmnumber: 1
zpe: 231162.0 jmol-1
zpe.correction: 0.088045 hartree
zpe.thermalcorrener: 0.098326 hartree
zpe.thermalcorrenthalpy: 0.099270 hartree
zpe.thermalcorrgfe: 0.049579 hartree
zpe.sumelectzpe: -1736.525232 hartree
zpe.sumelectthermal: -1736.514951 hartree
zpe.sumelectthermalent: -1736.514007 hartree
zpe.sumelectthermalfe: -1736.563698 hartree
dipole: -2.8569 0.3719 0.0845
dipole: 2.8823
quadrupole: -81.7714 -82.8055 -82.8955
quadrupole: -2.4098 -0.3201 0.1349
quadrupole: 0.7194 -0.3147 -0.4047 -2.4098 -0.3201 0.1349
hfenergy: -1736.6132772 hartree
pointgroup: C01 [X(C5H4Cl3N3)]
dipole: -1.120524 0.1714575 0.0305738 debye
dipolederiv: -0.3239702 0.0901076 0.2270758 0.0829053 -0.2252058 -0.2209643 0.1828585 -0.2133048 -0.5786123 -0.114802 -0.1119216 0.0000555 -0.0840383 -0.6825499 -0.0010513 0.0006648 -0.0010061 -0.1241714 -0.3199906 0.0895336 -0.2241794 0.0819335 -0.2255815 0.2217644 -0.1800523 0.2142912 -0.5800374 -1.0930444 0.279077 0.0081017 0.1741389 -0.4169583 0.0050653 -0.0022329 0.0032283 -0.1410335 -0.8164363 -0.2383481 0.000586 -0.3542839 -0.5909546 -0.0012028 -0.003917 0.0014454 -0.1100757 -0.5629228 0.0809224 -0.0056456 0.2893849 -0.8081758 -0.0104078 -0.0031933 -0.0016076 -0.1768297 0.9941157 0.0963257 -0.0012052 0.0737209 0.3046698 0.0003772 0.0121613 -0.0038851 -0.0163685 0.9415156 -0.4250592 -0.0217097 -0.4639275 0.7731471 0.0223256 -0.0537504 0.04802 0.1426337 0.6213129 -0.0773505 -0.0031506 -0.0006632 1.2699754 0.0007091 -0.0026114 0.0016209 1.3185819 -0.2378415 0.2421377 0.0262198 0.2469465 -0.1998738 -0.0239036 0.1440032 -0.1284956 -0.0279895 0.6623117 0.0758659 -0.0007795 0.0388533 0.6561875 0.002797 0.0050162 -0.0078783 0.0594203 0.1084227 0.0295643 0.0221988 0.0370176 0.1049528 -0.0156246 0.017499 -0.0133006 -0.0484856 0.062628 -0.0705538 0.0461453 -0.0302802 0.0121215 0.0657547 -0.0080647 0.09379 0.0938102 0.0053416 -0.0227544 -0.073896 -0.0532382 0.062217 -0.0460769 -0.1066628 0.0068865 0.0868982 0.0733597 -0.0375466 0.0001831 -0.0384695 -0.0339712 0.0004379 -0.0017182 0.0001958 0.1022594 unknown
polarizability: 119.061837|-5.9710981|107.2637472|-0.4196187|0.4689065|74.7784462 unknown
InChI: InChI=1S/C5H4Cl3N3/c1-3-9-2-10-4(11-3)5(6,7)8/h2H,1H3
charge 0 multiplicity 1
15 atoms
Cl 2.571682 -0.569958 -1.513467
Cl 2.129078 1.999652 0.005914
Cl 2.561616 -0.572638 1.522751
N  -0.596165 0.888527 -0.013054
N  -0.022349 -1.465929 -0.000342
N  -2.352448 -0.782796 -0.013105
C  0.293545 -0.136539 -0.002501
C  -1.924808 0.523297 -0.018965
C  1.793348 0.186989 0.002842
C  -2.955497 1.612113 -0.006401
C  -1.361075 -1.721143 -0.003279
H  -3.227089 1.855553 1.038855
H  -2.554833 2.526733 -0.469417
H  -3.871403 1.2789 -0.518491
H  -1.666104 -2.771661 -0.001641
