program: Gaussian 09
title: 000035150
version: EM64L-G09RevD.01
frameworkgroup: C1[X(C6H5Cl4N3)]
method: RPBEPBE
basis: SDD
operation: Freq
keyword: #p
keyword: freq=noraman
keyword: PBEPBE/SDD
title: #p freq=noraman PBEPBE/SDD
converged: YES YES NO NO
title: Mulliken charges:
elementType: Cl Cl Cl Cl N N N C C C C C C H H H H H
charge: 0.060194 0.041842 -0.020558 -0.020966 -0.009930 0.059185 0.009637 0.218447 0.145244 0.151105 -0.741278 -0.704908 -0.704396 0.356764 0.287318 0.293249 0.288488 0.290562
chargesum: 0.00000
title: Mulliken charges with hydrogens summed into heavy atoms:
elementType: Cl Cl Cl Cl N N N C C C C C C
charge: 0.060194 0.041842 -0.020558 -0.020966 -0.009930 0.059185 0.009637 0.218447 0.145244 0.151105 -0.384514 -0.124341 -0.125346
polarizability: 1.40771477e+02 3.55875379e+00 1.23508642e+02 -6.51779560e+00 3.50009756e+00 1.07388300e+02
1716.lowfreq: 0.0023 0.0032 0.0037 3.1043 5.1666 6.3121 22.6036 30.5391 35.2185
frequency: 22.5388 30.4761 35.2108 58.7203 94.0480 105.5560 134.2100 193.2315 225.1960 233.9136 264.1419 279.3024 327.1975 430.2537 530.7239 564.5589 614.1032 616.0552 654.4386 680.2312 714.9193 752.0467 764.6971 864.3271 876.0951 917.4780 922.4640 981.1940 999.6451 1104.5833 1129.2630 1181.8388 1209.7405 1241.4559 1265.4278 1268.1951 1331.9893 1343.5647 1390.9067 1433.3536 1442.5764 1465.5276 1479.1833 3089.1649 3090.0669 3156.7469 3183.4230 3184.5857
redmass: 19.8229 17.2602 9.0430 21.5519 18.6826 11.5751 6.3616 9.0764 13.4606 13.6209 3.2280 6.4132 7.2491 3.3328 7.4216 7.3107 10.6296 9.9052 9.1461 5.9881 5.8218 7.5245 9.1354 8.4207 2.0010 8.5818 2.3346 3.1457 3.3468 2.0015 1.2137 1.7480 1.0680 1.5850 1.1581 1.1723 5.0435 4.2917 3.3733 1.1708 1.4829 7.2086 8.4351 1.0562 1.0561 1.0891 1.1129 1.1130
irintensity: 0.6854 0.9208 0.6826 0.6555 0.6315 2.5644 3.0543 3.0448 1.7667 2.9920 4.2977 0.0441 0.1980 2.9287 11.3730 13.8147 33.9792 36.5385 133.8439 5.4102 18.4192 1.1124 23.4159 0.3260 3.9527 0.1858 2.5173 4.1904 6.5028 1.2574 12.9195 12.4665 8.2258 4.1755 5.7351 0.4591 16.2717 27.7292 5.0549 3.0816 10.9865 250.3064 231.5569 6.1761 7.1872 0.0031 0.2581 0.2310
temp: 298.150 k
press: 1.00000 atm
elementType: 17 17 17 17 7 7 7 6 6 6 6 6 6 1 1 1 1 1
symmnumber: 1
zpe: 286377.4 jmol-1
zpe.correction: 0.109075 hartree
zpe.thermalcorrener: 0.122386 hartree
zpe.thermalcorrenthalpy: 0.123330 hartree
zpe.thermalcorrgfe: 0.064405 hartree
zpe.sumelectzpe: -2235.151656 hartree
zpe.sumelectthermal: -2235.138345 hartree
zpe.sumelectthermalent: -2235.137401 hartree
zpe.sumelectthermalfe: -2235.196326 hartree
dipole: -0.4896 -1.1273 -3.3042
dipole: 3.5254
quadrupole: -112.5095 -102.2076 -99.1855
quadrupole: -0.5549 5.8548 -1.4238
quadrupole: -7.8753 2.4266 5.4487 -0.5549 5.8548 -1.4238
hfenergy: -2235.2607311 hartree
pointgroup: C01 [X(C6H5Cl4N3)]
dipole: -0.3069901 0.3817342 1.2976156 debye
dipolederiv: -0.2988829 -0.0086238 0.1990213 0.0205479 -0.1073926 -0.1690616 0.1454214 -0.0648431 -0.5482817 -0.439677 -0.0675648 -0.2671398 0.0024217 -0.0908006 0.058613 -0.2063245 -0.0310379 -0.5115238 -0.1477786 -0.0921489 -0.0532878 -0.0814075 -0.3979902 -0.0755682 -0.0774509 -0.1831279 -0.288959 -0.3213977 0.1528533 -0.0854599 0.1342817 -0.2207595 0.0378492 -0.1773048 0.1130369 -0.3063476 -1.0939722 0.1363945 0.052572 0.0749216 -0.4742918 -0.0068668 0.1607133 -0.0128197 -0.1475082 -0.6748256 -0.289247 0.035812 -0.3736742 -0.7794948 0.0584664 0.1169858 0.1113056 -0.1143612 -0.524218 0.2125116 0.0537596 0.1970933 -0.9497008 0.038896 0.0584563 0.0410155 -0.1570917 0.9815734 0.0850508 -0.0890258 0.2455166 0.4966723 -0.0443696 -0.1471579 -0.0445718 0.0381299 0.877253 -0.2941481 0.0319829 -0.273138 0.6776454 -0.09278 0.0176914 -0.1132295 0.0673537 0.5373805 0.119708 -0.0509651 0.1356363 1.0340705 0.0602634 -0.0559075 0.0686146 0.0392052 0.5992322 0.0176926 0.1087985 -0.0413955 0.2552237 0.1222684 0.0650712 0.1029448 1.1490368 0.1614451 0.0215692 0.0664967 0.0400662 0.1834385 0.0878424 0.0695838 0.0841181 0.387978 0.1934854 -0.0274577 0.0955725 -0.0248913 0.1543618 -0.0372348 0.1004466 -0.0337137 0.4050146 0.0288046 0.062576 -0.0191371 -0.0086872 0.0204621 -0.0055597 -0.0085131 -0.0159535 -0.0262806 0.0337467 -0.0498308 0.0577588 -0.0078157 0.066034 -0.0466538 0.033618 -0.0210508 -0.019398 0.0105289 0.0552906 -0.0745984 -0.002041 0.0510717 -0.0257027 -0.0518708 -0.0275278 0.0283905 0.0599803 -0.0449154 -0.0735525 0.0052376 0.0021396 -0.0346467 -0.0571506 -0.0151557 0.0189749 0.017322 0.0102899 0.0113923 -0.0426724 0.0793107 0.0742451 0.0136924 0.0419961 -0.0143317 unknown
polarizability: 140.1076542|-3.1107272|122.8447834|8.4374054|4.2509684|108.7159815 unknown
InChI: InChI=1S/C6H5Cl4N3/c7-1-3-11-4(2-8)13-6(12-3)5(9)10/h5H,1-2H2
charge 0 multiplicity 1
18 atoms
Cl 3.059173 0.340257 -1.771503
Cl 3.474691 0.718301 1.245679
Cl -1.179789 -3.455971 -1.063105
Cl -3.127042 2.127434 -1.183743
N  -0.021401 1.405385 0.163241
N  0.830754 -0.864213 0.201266
N  -1.522357 -0.444114 0.609779
C  0.981031 0.485077 0.063824
C  -1.263915 0.885436 0.435423
C  -0.442404 -1.28066 0.470446
C  2.354496 1.05187 -0.208849
C  -0.678138 -2.754553 0.620292
C  -2.411493 1.845418 0.544509
H  2.310222 2.13886 -0.334341
H  -1.520905 -2.963849 1.290898
H  0.241113 -3.282188 0.902444
H  -2.083606 2.832664 0.893361
H  -3.23003 1.426247 1.142279
