program: Gaussian 09
title: 000035145
version: EM64L-G09RevD.01
frameworkgroup: C1[X(C10H9N3)]
method: RPBEPBE
basis: SDD
operation: Freq
keyword: #pfreq=noraman
keyword: PBEPBE/SDD
title: #p freq=noraman PBEPBE/SDD
converged: NO YES NO NO
title: Mulliken charges:
elementType: N N N C C C C C C C C C C H H H H H H H H H
charge: -0.018549 -0.018565 0.005227 -0.622646 0.439144 0.106695 -0.376790 -0.376806 -0.223870 -0.223875 -0.238269 -0.306428 -0.306425 0.235783 0.235796 0.244732 0.244709 0.226532 0.226533 0.229300 0.258886 0.258886
chargesum: 0.00000
title: Mulliken charges with hydrogens summed into heavy atoms:
elementType: N N N C C C C C C C C C C
charge: -0.018549 -0.018565 0.005227 -0.151067 0.439144 0.106695 -0.132058 -0.132096 0.002662 0.002658 -0.008970 -0.047542 -0.047539
polarizability: 1.47087399e+02 -8.19793932e-03 1.23940340e+02 -5.60077049e+00 1.00595252e-03 8.20994847e+01
1716.lowfreq: -25.4177 -9.4516 -6.2956 -2.9198 -0.0006 0.0005 0.0009 27.4463 49.7094
frequency: -23.0222 27.0712 49.7084 154.1334 229.6343 264.4427 327.4706 379.1444 400.7243 456.0169 474.4584 565.7897 616.1489 620.4908 667.1955 702.2085 752.9892 774.4700 822.4816 852.2719 859.0370 917.0798 920.8395 927.9076 940.4475 977.5413 988.8046 989.8006 996.5034 1026.6696 1065.7341 1100.6654 1111.6201 1165.4245 1173.0183 1188.3657 1198.6621 1242.4602 1272.7673 1305.6543 1329.1367 1378.0598 1383.2082 1407.9390 1440.5976 1453.5933 1458.6821 1480.4101 1485.5831 1594.7538 1610.8233 3033.4735 3103.2695 3123.0219 3127.5150 3139.4281 3148.9440 3162.8623 3165.0269 3167.0920
redmass: 3.8714 5.2203 6.3616 7.6134 5.5012 5.0754 3.2924 1.8546 2.7921 4.4526 3.4863 5.2169 6.2984 3.6947 8.7665 1.8009 2.2766 3.2158 4.4407 1.2489 4.8381 1.9069 2.7751 2.5274 1.6596 1.3897 1.4968 5.9233 1.3331 2.2559 1.9331 1.8104 3.8390 3.6269 1.0673 1.1422 2.7452 1.9654 1.7511 2.2402 1.2638 1.3622 7.5407 2.0502 2.2578 1.1528 4.7910 2.4363 3.2791 6.1116 6.0840 1.0584 1.1045 1.0847 1.0879 1.0924 1.0967 1.0912 1.1017 1.0961
irintensity: 0.0008 0.0847 0.0647 0.8698 0.7768 0.4126 0.0395 2.1267 0.0146 1.4839 6.4543 15.0974 0.2250 38.3030 10.9698 52.8662 29.8099 8.4380 4.6124 0.1483 5.2273 0.3877 0.3379 3.1545 7.0847 0.2464 0.0002 0.5368 0.1148 9.0476 3.3350 5.0916 1.0435 0.7204 0.0658 1.5579 5.4719 9.3085 6.4095 16.3422 0.1033 30.8984 0.2548 187.0524 0.9300 17.9275 80.3186 132.3951 88.3143 1.0736 4.7326 13.7809 3.3074 2.8342 0.0848 16.3392 35.6275 20.4443 21.7169 9.8043
temp: 298.150 k
press: 1.00000 atm
elementType: 7 7 7 6 6 6 6 6 6 6 6 6 6 1 1 1 1 1 1 1 1 1
symmnumber: 1
zpe: 446800.9 jmol-1
zpe.correction: 0.170177 hartree
zpe.thermalcorrener: 0.179612 hartree
zpe.thermalcorrenthalpy: 0.180556 hartree
zpe.thermalcorrgfe: 0.133581 hartree
zpe.sumelectzpe: -549.791375 hartree
zpe.sumelectthermal: -549.781941 hartree
zpe.sumelectthermalent: -549.780997 hartree
zpe.sumelectthermalfe: -549.827972 hartree
dipole: 0.8471 -0.0001 0.3031
dipole: 0.8997
quadrupole: -75.4407 -70.9872 -76.1034
quadrupole: -0.0004 -5.3341 -0.0016
quadrupole: -1.2636 3.1899 -1.9263 -0.0004 -5.3341 -0.0016
hfenergy: -549.9615528 hartree
pointgroup: C01 [X(C10H9N3)]
dipole: -0.3338609 0.0000357 0.1176316 debye
dipolederiv: -0.7702646 -0.1134434 0.2712758 -0.3241334 -0.4522366 0.0962924 0.4483498 0.0446068 -0.3608934 -0.7703488 0.1136167 0.2712136 0.3243778 -0.4523012 -0.0961702 0.4480849 -0.044472 -0.3607856 -0.4359261 0.0000705 0.1164326 0.0001109 -0.7146153 0.0001869 0.1984672 0.0001776 -0.2498174 -0.4779403 0.0000245 0.0746068 0.0000785 0.1227345 -0.0000196 -0.080496 -0.0000185 0.0714723 0.352012 0.0000243 0.1114433 0.0000742 -0.0133838 -0.0000073 0.3843349 -0.0000054 -0.0422993 1.1428091 -0.0001059 -0.3907478 -0.0001959 0.3486978 -0.000055 -0.6930669 -0.0000527 0.2898157 -0.1798228 -0.0695266 0.0463773 -0.0393594 0.0285261 -0.045605 0.0127886 -0.0208915 -0.1262038 -0.1798329 0.0694837 0.0463621 0.0392434 0.028619 0.045645 0.0127855 0.0209123 -0.1261955 -0.0470782 0.0703123 0.0636527 0.072447 0.0912441 0.0418926 0.0484311 0.0489039 -0.0961048 -0.0470531 -0.070378 0.0636731 -0.0724986 0.091187 -0.0418642 0.0484344 -0.0488762 -0.096093 -0.0036979 0.0000138 0.1300539 0.0000278 -0.0684864 0.0000175 0.1139763 0.0000257 -0.0751671 0.4830103 0.0638197 -0.2264602 0.0772788 0.5977556 -0.0261905 -0.3037691 -0.0510462 0.2245582 0.4830254 -0.064033 -0.2264244 -0.0775345 0.5977914 0.0258786 -0.3036984 0.0507282 0.2245063 0.0587037 -0.0045176 -0.0116813 -0.0229501 -0.0199501 -0.1163879 -0.0066337 -0.0329805 0.0261715 0.0586825 0.0045366 -0.0117372 0.0229192 -0.0198654 0.1164028 -0.0066806 0.0329992 0.0260895 0.0851581 0.084828 -0.0615004 0.0770508 -0.0274907 0.039927 -0.0442723 0.0458073 0.1033143 0.08519 -0.084796 -0.0614906 -0.0769961 -0.027566 -0.0399677 -0.0442608 -0.0458483 0.1033033 0.0552206 -0.0724353 -0.0565895 -0.0898495 -0.0728693 -0.0514363 -0.0758491 -0.0485624 0.1157041 0.055162 0.0724952 -0.056607 0.0899005 -0.0728115 0.0514077 -0.0758736 0.0485322 0.1157096 -0.052986 -0.0000229 -0.1334108 -0.0000262 0.0889206 -0.0000274 -0.1374196 -0.0000268 0.0693465 0.0529974 -0.0556637 0.0207963 -0.0640271 -0.0269295 0.0380752 0.0282024 0.0431202 0.0817545 0.0529794 0.0556971 0.0207618 0.0640619 -0.0269702 -0.0379945 0.0281653 -0.0430329 0.0818141 unknown
polarizability: 147.0311451|-0.0085024|123.9403405|5.9178772|-0.0022565|82.1557384 unknown
InChI: InChI=1S/C10H9N3/c1-2-4-9(5-3-1)6-10-12-7-11-8-13-10/h1-5,7-8H,6H2
charge 0 multiplicity 1
22 atoms
N  1.810761 1.214083 0.288961
N  1.810967 -1.213932 0.289827
N  3.4872 -0.000239 -0.990322
C  0.059939 0.000377 1.553707
C  -1.212953 0.000149 0.699342
C  1.291843 0.000167 0.676206
C  -1.801108 -1.222163 0.287448
C  -1.801592 1.222238 0.287486
C  -2.965129 -1.222791 -0.513875
C  -2.965615 1.222433 -0.513836
C  -3.551537 -0.000288 -0.916056
C  2.895672 1.14718 -0.535784
C  2.895866 -1.147431 -0.534974
H  0.091726 0.900878 2.189014
H  0.091755 -0.899806 2.189465
H  -1.342998 -2.170334 0.592387
H  -1.343857 2.170581 0.592453
H  -3.413861 -2.173881 -0.822019
H  -3.414725 2.173355 -0.821947
H  -4.455361 -0.000461 -1.535581
H  3.33202 2.094875 -0.866105
H  3.332388 -2.095288 -0.864598
