program: Gaussian 09
title: 000035151
version: EM64L-G09RevD.01
frameworkgroup: C1[X(C8H11Cl2N3S2)]
method: RPBEPBE
basis: SDD
operation: Freq
keyword: #p
keyword: freq=noraman
keyword: PBEPBE/SDD
title: #p freq=noraman PBEPBE/SDD
converged: YES YES NO NO
title: Mulliken charges:
elementType: Cl Cl S S N N N C C C C C C C C H H H H H H H H H H H
charge: 0.036989 0.044488 0.215900 0.289375 0.071957 -0.025150 -0.041956 -0.916522 0.235658 0.209591 0.060964 -0.751258 -0.747874 -0.844387 -0.841889 0.319076 0.352112 0.246149 0.255648 0.248581 0.253728 0.255016 0.288180 0.255218 0.273907 0.256499
chargesum: 0.00000
title: Mulliken charges with hydrogens summed into heavy atoms:
elementType: Cl Cl S S N N N C C C C C C C C
charge: 0.036989 0.044488 0.215900 0.289375 0.071957 -0.025150 -0.041956 -0.597446 0.235658 0.209591 0.060964 -0.399146 0.002505 -0.047464 -0.056266
polarizability: 1.90729363e+02 -8.82877848e-01 1.82727547e+02 -7.91613533e+00 4.09489896e+00 1.31519728e+02
1716.lowfreq: -5.7524 -3.2183 0.0020 0.0022 0.0026 5.8887 12.3004 20.0442 27.6185
frequency: 10.3549 19.8445 27.5581 58.0530 63.5868 67.4491 85.6086 103.2576 120.2467 148.5682 151.8831 175.2126 177.7987 195.5244 219.0028 230.5166 236.4153 268.6846 297.8799 335.6255 432.1354 549.6865 574.2176 600.8487 631.4099 645.5902 658.8401 667.9203 676.5765 714.8320 744.3334 761.7971 847.2364 917.0806 948.5322 955.9370 968.1913 973.0079 981.9700 991.6970 1044.0991 1050.8821 1137.1508 1171.3570 1209.5594 1212.0010 1230.8038 1320.3903 1337.2628 1341.7821 1343.8759 1384.6298 1410.1942 1437.2867 1441.4913 1448.0121 1454.9463 1461.1426 1463.6743 1473.4688 1481.6696 3000.4532 3000.8453 3003.5991 3066.9407 3082.4211 3118.0419 3123.3922 3132.5125 3134.2975 3138.0538 3156.8526
redmass: 1.1097 6.3141 6.3284 4.7573 3.3544 7.8683 8.4592 2.7289 1.4004 3.0571 2.3442 1.6030 4.8589 6.8959 4.5055 11.5313 5.6872 10.2059 6.1665 12.8259 4.6701 6.2081 7.0226 5.9651 9.2638 7.1569 7.3690 5.7719 6.5277 5.6859 5.4283 7.6907 8.9383 13.2485 3.3812 2.7636 1.2063 1.1944 1.2500 1.4264 2.5210 1.6792 3.5818 1.1192 1.4511 1.0741 1.7491 3.9382 1.1356 1.2459 3.1085 1.7501 3.0859 1.6278 1.1293 1.0526 1.0580 1.0632 1.0645 4.1904 2.7345 1.0384 1.0290 1.0283 1.0863 1.0959 1.1058 1.1053 1.1036 1.1025 1.1002 1.0889
irintensity: 0.5617 0.0457 0.6716 0.8709 1.3553 1.2457 0.7578 1.3776 0.5575 0.8176 3.1857 0.9668 2.5226 1.3933 1.3352 1.2290 0.4246 3.8151 0.5937 0.5599 4.7778 16.9236 2.8991 32.7672 45.1803 1.4065 4.3636 69.5815 11.5037 28.3410 38.3834 20.2178 3.8290 2.5785 0.4556 9.5737 3.4660 3.8771 16.4909 2.6662 5.7410 10.6313 0.6892 26.0249 11.1087 9.2400 1.0980 17.2206 2.1129 3.2893 47.9101 42.0105 21.5720 165.1909 38.7683 15.9552 24.1473 38.7003 12.1997 301.1502 199.4964 2.3199 31.9151 28.3675 3.4580 6.4141 13.7903 15.6025 6.2549 7.5161 8.5479 0.2555
temp: 298.150 k
press: 1.00000 atm
elementType: 17 17 16 16 7 7 7 6 6 6 6 6 6 6 6 1 1 1 1 1 1 1 1 1 1 1
symmnumber: 1
zpe: 478793.4 jmol-1
zpe.correction: 0.182363 hartree
zpe.thermalcorrener: 0.200743 hartree
zpe.thermalcorrenthalpy: 0.201687 hartree
zpe.thermalcorrgfe: 0.130738 hartree
zpe.sumelectzpe: -2190.786927 hartree
zpe.sumelectthermal: -2190.768547 hartree
zpe.sumelectthermalent: -2190.767603 hartree
zpe.sumelectthermalfe: -2190.838552 hartree
dipole: -3.2711 3.9875 -1.6155
dipole: 5.4046
quadrupole: -107.6317 -110.2847 -118.8733
quadrupole: 3.7956 2.3311 2.1522
quadrupole: 4.6315 1.9786 -6.6101 3.7956 2.3311 2.1522
hfenergy: -2190.9692901 hartree
pointgroup: C01 [X(C8H11Cl2N3S2)]
dipole: -1.0922774 -1.7713124 -0.4367176 debye
dipolederiv: -0.2354095 -0.0670191 -0.1220749 -0.1386387 -0.1692897 -0.0841772 -0.2214281 0.0167418 -0.6385662 -0.181563 -0.0600753 -0.0318428 -0.1637345 -0.4731549 0.3114175 0.0040937 0.2018869 -0.3442141 -0.3940169 0.0689565 -0.0684163 0.1671756 -0.0225237 -0.0290128 -0.0125381 -0.1085308 -0.2561288 0.0578247 0.0526999 0.012262 0.1121168 -0.0604016 -0.1118044 0.0131915 -0.018151 -0.2607693 -1.3698955 -0.0122663 -0.0104344 -0.1737154 -0.3315332 -0.1150177 0.1132539 -0.1055804 -0.1452915 -0.8284971 0.313905 0.1184083 0.4666052 -0.8547495 -0.1684885 0.1961606 -0.2537689 -0.2557281 -0.6738144 -0.2458105 -0.0902846 -0.0648468 -0.9809223 -0.2842548 0.01554 -0.2855037 -0.2661746 -0.105558 0.0226241 0.0912209 -0.0068977 0.0619796 0.2197604 -0.1932629 0.1992174 0.5949484 1.4054474 -0.3302378 -0.0245296 -0.3037441 0.5126526 0.0800789 0.0404253 0.1067498 0.0681483 0.9678784 0.2503058 0.0669157 0.0872814 0.6359719 0.2145361 -0.0225821 0.2226931 0.0817184 0.5985517 -0.0305256 0.0116363 -0.1485089 1.1579625 0.3434114 -0.1079562 0.4071431 0.3005428 0.3893047 0.0485201 0.1310798 0.1998866 0.6171501 -0.2633214 0.1580473 -0.2666007 1.043207 0.0524165 -0.1071909 -0.0438825 0.0644507 -0.3984765 -0.1404265 0.0290687 -0.1722798 -0.0834834 0.1047566 0.0591082 -0.0155691 0.0324735 0.052537 0.046577 0.0059689 0.0268853 -0.0705993 0.0974835 0.0080308 -0.1086158 0.0050459 0.0224405 -0.0613969 -0.065554 -0.0395996 0.0310989 0.0146864 -0.0353999 -0.010248 -0.0187084 -0.0556492 0.0263749 0.0175549 -0.043257 -0.0551442 0.0334474 -0.0114447 -0.0131213 0.0529664 0.0019635 0.0065047 0.0134054 0.0169448 -0.0269398 0.0689707 0.0335718 -0.0855654 0.0192286 0.0933901 0.0032149 -0.0671743 -0.0305736 -0.0279232 -0.0714895 0.0815575 0.0336835 -0.0029076 0.0951643 -0.0088958 0.0026278 -0.005332 0.1203504 0.0728177 -0.0219161 0.080936 -0.0244223 0.0208286 0.0457829 0.0557401 0.0888158 0.0403137 0.0629307 -0.0163874 -0.1016695 0.0049946 0.0721075 -0.0077777 -0.0833328 0.0134771 -0.0776005 -0.0559087 -0.08377 0.0490484 -0.1189002 -0.0042766 -0.0132285 0.0918484 0.0367691 0.0221511 0.0074832 0.0703596 0.0216181 0.0419626 -0.0399747 -0.0621778 0.0307041 -0.0148413 0.1131017 -0.0393454 -0.0229966 0.0824714 -0.0876806 -0.0679769 0.1172774 0.0342248 0.059599 0.0580551 -0.0340981 0.0055983 -0.0311626 -0.0411228 0.1088685 0.0350216 -0.1224008 0.056687 0.0068425 0.0555964 0.0298027 0.0581364 0.0396401 0.0059123 -0.099978 0.0743741 -0.1095913 0.0280848 unknown
polarizability: 190.3764511|-2.7236824|162.1520243|7.2075405|25.7804422|152.4481628 unknown
InChI: InChI=1S/C8H11Cl2N3S2/c1-4-11-6(5(9)10)13-7(12-4)8(14-2)15-3/h5,8H,1-3H3
charge 0 multiplicity 1
26 atoms
Cl 3.495828 1.18111 2.139083
Cl 3.137648 2.405022 -0.652386
S  -2.383264 0.795793 -1.107457
S  -1.663291 1.382117 1.875941
N  0.799451 0.474472 0.441312
N  -0.118393 -1.662153 -0.247414
N  2.267001 -1.277042 -0.376061
C  -1.643326 0.090955 0.522909
C  -0.246619 -0.381871 0.235279
C  2.020957 -0.026122 0.120763
C  1.155343 -2.068717 -0.546325
C  3.25241 0.82567 0.323571
C  1.346779 -3.456463 -1.087174
C  -3.054688 -0.806425 -1.850379
C  -3.513042 1.291644 2.228643
H  -2.275559 -0.768052 0.799056
H  4.149091 0.298404 -0.018414
H  0.845169 -3.555317 -2.067154
H  2.41752 -3.676904 -1.202801
H  0.879674 -4.196661 -0.41428
H  -3.4154 -0.549038 -2.858875
H  -3.88737 -1.192946 -1.241533
H  -2.246842 -1.551249 -1.914617
H  -3.773498 0.334882 2.708506
H  -4.065209 1.421685 1.283894
H  -3.741271 2.127104 2.908116
