program: Gaussian 09
title: 000005696
version: EM64L-G09RevD.01
frameworkgroup: C1[X(C17H11N3O14S3)]
method: RPBEPBE
basis: SDD
operation: Freq
keyword: #p
keyword: freq=noraman
keyword: PBEPBE/SDD
title: #p freq=noraman PBEPBE/SDD
converged: YES YES NO NO
title: Mulliken charges:
elementType: S S S O O O O O O O O O O O O O O N N N C C C C C C C C C C C C C C C C C H H H H H H H H H H H
charge: 0.960279 0.970197 0.995747 -0.614786 -0.554714 -0.460597 -0.462980 -0.559366 -0.481746 -0.473539 -0.471707 -0.476943 -0.229963 -0.227169 -0.171958 -0.151101 -0.178269 -0.509040 0.022307 0.024060 0.332979 0.657391 -0.219160 0.355882 -0.394894 -0.399258 -0.124295 -0.254205 -0.346096 -0.282745 0.150985 0.352085 -0.497113 -0.493227 0.444068 0.434807 -0.502573 0.330517 0.343862 0.314321 0.305366 0.364812 0.419437 0.392755 0.336449 0.296960 0.392452 0.339725
chargesum: 0.00000
title: Mulliken charges with hydrogens summed into heavy atoms:
elementType: S S S O O O O O O O O O O O O O O N N N C C C C C C C C C C C C C C C C C
charge: 0.960279 0.970197 0.995747 -0.195348 -0.161959 -0.460597 -0.462980 -0.166915 -0.481746 -0.473539 -0.471707 -0.476943 -0.229963 -0.227169 -0.171958 -0.151101 -0.178269 -0.144227 0.022307 0.024060 0.332979 0.657391 -0.219160 0.355882 -0.394894 -0.068741 -0.124295 0.089657 -0.031775 0.022621 0.150985 0.352085 -0.160664 -0.196266 0.444068 0.434807 -0.162848
polarizability: 5.54968583e+02 -7.52831310e+00 3.91929124e+02 -1.45099996e+01 -1.56718227e+01 2.03041641e+02
1716.lowfreq: -3.0700 -0.6925 -0.0020 -0.0018 -0.0016 1.7399 12.2120 20.4350 21.5790
frequency: 12.1901 20.4242 21.5619 26.6912 33.8966 40.5415 50.9438 56.5849 67.6185 74.8821 78.9612 80.5442 98.0975 105.7918 118.2925 121.7449 129.3565 140.5288 151.7255 165.2379 171.1443 177.4513 185.1506 193.6969 194.4347 205.7692 210.8767 218.9270 236.6263 238.4302 249.6862 277.4555 283.5124 289.7656 294.9193 309.8431 313.2975 321.3247 325.6989 334.7320 338.4042 352.6264 359.3953 373.9545 389.7201 410.6936 423.2013 431.6955 455.9411 462.5258 480.3743 483.0312 507.8895 510.1296 517.6788 532.7031 543.4740 553.8248 560.8099 570.2256 589.5767 602.7285 627.5661 640.6815 646.6416 656.9288 684.5043 701.7666 702.6639 724.6019 738.3957 745.6411 792.2238 809.3795 831.2199 838.6410 839.2783 846.9266 858.3310 867.1706 869.4211 898.7413 916.8833 937.1372 941.4605 947.7820 965.6643 968.1803 977.3496 981.3105 986.0291 990.7834 990.8970 1021.6172 1040.0948 1046.4712 1051.5699 1074.3663 1111.0940 1126.7002 1136.8953 1144.3788 1194.4032 1198.7106 1206.2142 1213.5883 1252.9420 1278.6416 1302.6167 1327.5249 1341.5641 1364.4701 1376.7964 1387.2531 1405.4407 1409.7582 1432.1153 1438.0947 1468.7699 1504.1039 1542.8620 1577.4467 1584.2993 1597.5993 1611.8647 1621.3666 1638.5142 3126.1221 3150.4930 3161.0553 3179.1466 3190.2644 3199.9079 3212.2738 3283.0985 3336.6215 3478.2757 3479.2237
redmass: 12.3574 11.9582 12.2865 10.4304 10.1419 10.9678 14.9071 11.7164 9.8210 12.1121 8.7739 11.9675 10.0893 12.1377 13.0628 10.7625 8.8349 9.2107 7.5667 5.4046 4.5815 7.5992 4.8401 4.4701 4.4954 6.7243 2.5747 4.9382 4.2127 4.3680 4.6362 7.4272 4.7136 6.0610 4.3931 9.5319 7.3058 7.1405 10.0484 11.2930 10.6347 8.7436 10.6834 7.2267 8.5818 9.4733 10.3889 10.7709 5.4607 6.3153 4.8163 5.9850 8.6604 8.7695 7.9051 8.8566 11.8417 4.8494 1.4577 5.2751 5.7636 8.5329 4.1251 6.4119 5.9262 4.4350 12.1197 3.8963 4.6121 8.5585 9.5772 5.6188 7.0301 7.1878 11.0360 7.2867 10.5810 2.9327 1.6580 1.5886 6.5302 4.1792 6.0349 1.4070 2.1794 1.6268 1.5173 11.6294 15.3404 3.1718 1.7573 2.3016 2.4013 5.0057 1.2072 1.1686 1.1719 1.4291 2.0655 2.1640 2.4401 4.8203 1.6387 6.4833 4.5914 2.5016 1.9381 2.0406 2.2591 2.9882 2.8259 5.2911 10.7263 10.3759 5.1452 3.0681 3.1700 5.1563 3.5875 5.3667 2.6628 6.8900 5.9275 6.6993 7.8125 7.4074 2.3850 1.0926 1.0936 1.0925 1.0926 1.0933 1.0921 1.0938 1.0833 1.0677 1.0662 1.0663
irintensity: 0.2006 0.1835 1.1266 1.0883 0.9546 0.9406 0.2178 2.2187 3.3446 0.1378 0.2609 1.8017 7.5858 2.3247 4.0460 4.6350 5.2531 2.4178 5.5400 21.5126 2.6471 11.6850 14.1994 9.8005 8.9675 2.5972 44.1054 4.1651 3.4692 4.1372 9.7487 41.5608 38.6793 57.8917 36.4405 11.1253 5.3527 16.9842 15.9942 10.5652 7.1990 3.1661 12.7755 3.9524 27.6832 80.6643 24.3966 85.6028 31.0325 2.4117 50.9602 12.7273 10.6153 47.0716 15.4922 89.0147 174.7159 10.0172 145.8571 105.5255 22.6751 28.0571 3.1906 101.4736 4.8836 47.5686 44.7695 31.2537 17.8069 1.2665 8.6357 3.8396 2.0537 3.2077 94.2126 32.5395 104.5796 30.7564 15.7219 31.8401 17.5392 19.8531 0.6884 7.7807 22.3036 29.0225 27.8975 102.6321 52.7128 68.5992 20.0876 7.4745 0.3260 18.3075 63.0577 70.2257 108.6289 98.5428 5.3422 52.8904 4.6934 84.8258 26.3665 198.1726 278.7145 70.2166 25.0526 27.5493 232.3441 5.4775 105.1703 158.1302 144.5524 122.8485 3.3110 14.6917 14.1676 3.9270 88.8826 30.4813 529.1374 37.4214 16.2612 29.3043 31.5389 1.1665 48.9824 35.3434 24.3637 11.0233 16.9254 32.6963 5.0669 6.9474 228.9703 420.3829 55.4278 74.2181
temp: 298.150 k
press: 1.00000 atm
elementType: 16 16 16 8 8 8 8 8 8 8 8 8 8 8 8 8 8 7 7 7 6 6 6 6 6 6 6 6 6 6 6 6 6 6 6 6 6 1 1 1 1 1 1 1 1 1 1 1
symmnumber: 1
zpe: 740666.6 jmol-1
zpe.correction: 0.282105 hartree
zpe.thermalcorrener: 0.318552 hartree
zpe.thermalcorrenthalpy: 0.319496 hartree
zpe.thermalcorrgfe: 0.210380 hartree
zpe.sumelectzpe: -3062.617412 hartree
zpe.sumelectthermal: -3062.580964 hartree
zpe.sumelectthermalent: -3062.580020 hartree
zpe.sumelectthermalfe: -3062.689137 hartree
dipole: -0.1219 0.1772 5.3858
dipole: 5.3901
quadrupole: -277.8696 -261.0659 -247.0946
quadrupole: 3.9607 -10.2968 3.3371
quadrupole: -15.8596 0.9441 14.9155 3.9607 -10.2968 3.3371
hfenergy: -3062.8995168 hartree
pointgroup: C01 [X(C17H11N3O14S3)]
dipole: -0.0199746 -0.0906165 -2.1185841 debye
polarizability: 554.1786667|11.1291178|391.9882228|19.119331|-17.0195318|203.7724579 unknown
InChI: InChI=1S/C17H11N3O14S3/c21-17(8-3-9(19(22)23)5-10(4-8)20(24)25)18-13-1-2-14(36(29,30)31)12-6-11(35(26,27)28)7-15(16(12)13)37(32,33)34/h1-7,18,26,29,32H
charge 0 multiplicity 1
48 atoms
S  0.030564 2.03256 0.774532
S  -4.979862 -3.007714 -0.323136
S  -5.402547 2.575655 0.374948
O  0.740315 1.944954 -0.968784
O  -5.406376 -2.260454 -1.966894
O  -0.351476 3.563427 1.099225
O  1.018724 1.229108 1.763464
O  -5.228028 3.169915 -1.370359
O  -4.810083 -4.607225 -0.45644
O  -5.987224 -2.387273 0.781268
O  -6.763992 1.72578 0.536879
O  -5.035466 3.790486 1.375194
O  1.835992 -2.784017 0.406034
O  3.463208 2.910503 -1.843634
O  6.559503 -2.36867 1.797377
O  5.742072 2.854222 -1.820155
O  7.812768 -0.586464 1.114029
N  0.729458 -0.847878 -0.366575
N  4.598415 2.334602 -1.572759
N  6.713522 -1.255041 1.172561
C  -1.686135 -0.335579 0.005702
C  -3.067699 -0.836417 -0.067486
C  -1.579486 1.069692 0.316031
C  -0.607777 -1.286891 -0.239158
C  -3.260171 -2.239129 -0.251688
C  -4.181359 0.060948 0.03629
C  -3.942006 1.401871 0.250162
C  -2.652687 1.945165 0.426762
C  -0.894141 -2.657949 -0.384734
C  -2.219631 -3.144969 -0.38128
C  1.869147 -1.598797 -0.033034
C  3.183663 -0.8695 -0.176602
C  4.30528 -1.390011 0.513172
C  3.325569 0.314509 -0.927087
C  4.547542 1.010067 -0.905478
C  5.527919 -0.694493 0.454475
C  5.683917 0.523537 -0.236231
H  -5.208995 -0.311742 -0.026353
H  -2.508964 3.003439 0.678456
H  -0.067362 -3.354488 -0.519581
H  -2.425502 -4.212042 -0.510456
H  0.871847 0.125216 -0.687357
H  1.518314 2.575903 -1.08896
H  -6.361894 -2.481749 -2.171253
H  4.214643 -2.318613 1.084551
H  2.51505 0.71214 -1.538032
H  -5.865904 3.929901 -1.50824
H  6.636333 1.060006 -0.236565
