program: Gaussian 09
title: 000005504
version: EM64L-G09RevD.01
frameworkgroup: C1[X(C10H12N2)]
method: RPBEPBE
basis: SDD
operation: Freq
keyword: #pfreq=noraman
keyword: PBEPBE/SDD
title: #p freq=noraman PBEPBE/SDD
converged: YES YES NO NO
title: Mulliken charges:
elementType: N N C C C C C C C C C C H H H H H H H H H H H H
charge: -0.433677 -0.113838 0.228245 -0.381442 -0.616847 -0.479702 0.461139 -0.377437 -0.443845 -0.217590 -0.219379 -0.246439 0.217052 0.225195 0.249293 0.226323 0.225883 0.226753 0.302932 0.247565 0.236466 0.226746 0.227057 0.229548
chargesum: 0.00000
title: Mulliken charges with hydrogens summed into heavy atoms:
elementType: N N C C C C C C C C C C
charge: -0.130745 -0.113838 0.228245 0.060805 -0.141231 -0.027066 0.461139 -0.129872 -0.207379 0.009156 0.007678 -0.016891
polarizability: 1.45637302e+02 1.80004691e+00 1.03292169e+02 1.80268817e+01 -7.55376932e+00 9.12581741e+01
1716.lowfreq: -13.9855 -9.0055 -0.0005 0.0004 0.0006 3.8493 19.1478 34.5549 65.8453
frequency: 18.2780 33.8518 65.7327 127.8338 202.9372 230.5455 303.2438 345.5392 403.5340 427.0932 467.5096 540.3852 607.5048 621.3934 687.1327 710.6244 722.9613 769.8930 814.0763 830.7072 858.0924 896.4902 902.2946 924.5616 947.4008 980.0084 983.2500 990.2663 997.5171 1026.1338 1046.0429 1077.1164 1082.5969 1160.3944 1170.0533 1172.9904 1187.8044 1206.8395 1209.6273 1252.3676 1274.6343 1289.8770 1308.6228 1332.5451 1381.0471 1435.3952 1441.3784 1460.2503 1468.4143 1482.9810 1502.4289 1590.4240 1598.9760 1613.9559 2962.1050 2997.8579 3000.0134 3035.0194 3063.0296 3069.8710 3116.5162 3119.8770 3133.5291 3144.6000 3162.6857 3577.5898
redmass: 3.7078 3.6653 4.1282 2.1801 3.8807 3.8705 5.2222 1.9534 2.7522 1.2142 3.3694 3.9394 4.7318 5.4578 4.0081 1.5362 3.8737 2.3206 3.2725 1.4844 1.2472 4.3258 2.1282 1.6735 2.8272 1.3897 3.2775 6.2165 1.3223 2.2118 3.3353 1.6765 1.6109 1.1652 1.1420 1.1007 1.1192 2.2732 1.1207 1.4414 1.5632 1.4478 1.5219 1.3138 7.7751 2.1776 1.9830 1.1767 1.1036 2.2174 1.1360 6.4137 6.3785 6.1380 1.0647 1.0660 1.0632 1.0958 1.1043 1.0975 1.0866 1.0870 1.0913 1.0960 1.1015 1.0793
irintensity: 0.3487 3.6659 0.9344 0.7573 8.7756 8.3547 3.4967 6.3016 3.2244 133.4654 6.9269 5.4582 2.7479 1.5813 7.7318 79.5780 5.3260 22.1364 3.3751 1.5877 0.0229 2.3000 11.7212 3.4224 14.1171 0.0631 10.8238 0.1666 0.8445 7.6148 7.8446 4.4917 8.4682 3.3433 7.7221 4.7578 0.6824 0.6269 0.8795 10.2618 67.1589 0.6000 3.7168 0.7584 0.1834 60.8072 34.2124 13.0176 0.3210 17.0020 12.8510 44.7438 91.1553 2.0649 68.7210 57.6467 18.6621 44.1465 47.5391 4.4535 7.7533 1.5326 10.5625 39.7148 22.9039 16.6316
temp: 298.150 k
press: 1.00000 atm
elementType: 7 7 6 6 6 6 6 6 6 6 6 6 1 1 1 1 1 1 1 1 1 1 1 1
symmnumber: 1
zpe: 523762.5 jmol-1
zpe.correction: 0.199491 hartree
zpe.thermalcorrener: 0.210091 hartree
zpe.thermalcorrenthalpy: 0.211035 hartree
zpe.thermalcorrgfe: 0.160902 hartree
zpe.sumelectzpe: -496.879355 hartree
zpe.sumelectthermal: -496.868754 hartree
zpe.sumelectthermalent: -496.867810 hartree
zpe.sumelectthermalfe: -496.917943 hartree
dipole: 1.2417 0.7737 2.8138
dipole: 3.1714
quadrupole: -68.5490 -66.3749 -73.8498
quadrupole: -2.1356 -4.4096 -1.8853
quadrupole: 1.0422 3.2164 -4.2586 -2.1356 -4.4096 -1.8853
hfenergy: -497.0788453 hartree
pointgroup: C01 [X(C10H12N2)]
dipole: 0.3964865 -0.8731642 0.7982535 debye
dipolederiv: -0.5439388 -0.1861817 0.2354429 0.1346947 -0.8181554 0.1138613 0.0373976 0.2207612 -0.5806865 -0.678033 0.2152307 -0.0697987 0.20573 -0.6212447 0.1142101 0.0421016 0.0614036 -0.4183266 0.5579328 -0.1781141 -0.1234901 -0.3936164 0.8415656 -0.4363853 -0.2520379 -0.463845 0.4378169 0.3172217 0.1986509 -0.1747853 0.0646928 0.0878607 0.2105273 -0.0732569 0.1158648 0.290043 -0.0692131 0.0184551 0.0558511 0.1741355 0.0995678 0.0638625 0.0887291 0.0415094 0.0604937 0.3132263 -0.0404345 0.0237398 0.0153312 0.1938645 0.0708957 -0.013246 0.102405 0.198428 0.2749656 -0.043079 0.1257126 -0.0818111 -0.0120328 -0.0287603 0.2322986 -0.0280643 -0.0149591 -0.149349 -0.0757101 -0.0113016 -0.1031558 -0.0081446 0.0392422 -0.0599487 0.055733 -0.1321279 -0.1942586 0.0039427 0.0359972 0.0051194 -0.0265544 0.1217967 0.032633 0.1142311 -0.0495183 -0.04054 -0.0015012 0.0663403 0.0052205 0.0269555 0.1197065 0.0821439 0.1146626 -0.0158688 -0.0079613 -0.1027381 0.0292459 -0.1068577 0.046947 0.0524847 0.0104283 0.0635985 -0.0830884 0.0026446 -0.0411107 0.115325 -0.0302051 -0.1048477 0.0163011 0.0988565 0.018268 -0.0833483 0.0177006 -0.0373968 -0.0556563 0.0038198 0.0627267 -0.0882687 0.0153079 -0.0183431 -0.2210843 -0.0547372 -0.1291975 0.0668802 -0.153331 -0.0764439 0.0479209 0.0412239 0.0107119 0.044005 0.0342634 0.0154872 -0.0391155 -0.0203796 -0.0172222 0.1016048 -0.0336214 0.0408859 0.0527711 0.0006623 0.0179621 0.0248862 -0.0125166 -0.0301475 -0.1475239 0.0050427 -0.068365 0.0011673 -0.1721697 -0.0016448 -0.0757264 -0.1200221 0.069364 -0.0043626 -0.0796965 -0.0308951 0.0101063 0.0263296 0.0569969 0.0179597 0.0748735 -0.0597971 -0.0926848 0.1287514 -0.1184717 -0.0097393 0.1860042 0.1064899 0.0259265 0.111906 0.2625213 0.0564928 -0.0137736 0.1010848 0.1793318 0.0608438 0.1112981 -0.0032662 0.1135828 -0.0004003 -0.0389557 -0.0024165 -0.030462 0.1073077 0.0914634 -0.0403505 -0.0819366 -0.0264751 0.0158917 -0.1048045 -0.0685774 -0.1163761 0.0168579 0.0719328 -0.0207855 -0.062168 -0.0331715 0.0006321 -0.1221923 -0.0798671 -0.1201778 0.025349 0.0162299 0.1144375 -0.0063663 0.1312779 -0.0360357 -0.0507805 -0.0096392 -0.0531771 0.1164419 -0.0612204 0.0392932 -0.1196964 0.0411577 0.1031296 -0.0141879 -0.1288331 -0.0129429 0.0686276 unknown
polarizability: 141.9302606|-19.4088803|104.0205763|11.2372824|7.9708505|94.2368085 unknown
InChI: InChI=1S/C10H12N2/c1-2-4-9(5-3-1)8-10-11-6-7-12-10/h1-5,11H,6-8H2
charge 0 multiplicity 1
24 atoms
N  -1.834317 -0.842734 0.358374
N  -2.575891 1.074931 -0.686282
C  -1.621626 0.168961 -0.588995
C  -3.04217 -0.517574 1.153212
C  -0.383527 0.146661 -1.461484
C  -3.634409 0.675977 0.310249
C  0.91459 -0.034015 -0.676635
C  1.31714 0.937931 0.27738
C  1.741995 -1.166037 -0.883331
C  2.518283 0.781737 1.002549
C  2.946062 -1.326728 -0.157352
C  3.338074 -0.352437 0.788095
H  -2.77636 -0.207019 2.184478
H  -3.735089 -1.375485 1.214035
H  -0.381164 1.09773 -2.021547
H  -0.486853 -0.668926 -2.202738
H  -4.54201 0.366558 -0.241592
H  -3.902592 1.543058 0.938309
H  -1.081184 -1.434081 0.708747
H  0.68364 1.817948 0.444245
H  1.446363 -1.922094 -1.621645
H  2.818272 1.543025 1.731773
H  3.575667 -2.206491 -0.332612
H  4.271305 -0.472398 1.349664
