program: Gaussian 09
title: 000035102
version: EM64L-G09RevD.01
frameworkgroup: C1[X(C8H14BrN5)]
method: RPBEPBE
basis: SDD
operation: Freq
keyword: #p
keyword: freq=noraman
keyword: PBEPBE/SDD
title: #p freq=noraman PBEPBE/SDD
converged: YES YES NO NO
title: Mulliken charges:
elementType: Br N N N N N C C C C C C C C H H H H H H H H H H H H H H
charge: -0.000087 -0.339369 -0.331697 -0.100951 -0.024794 -0.024619 -0.295244 -0.415321 -0.673319 0.082665 -0.305103 0.085547 -0.714520 -0.294533 0.225427 0.227301 0.213606 0.211240 0.336005 0.213898 0.213738 0.225127 0.233231 0.233705 0.337737 0.225104 0.224288 0.230937
chargesum: 0.00000
title: Mulliken charges with hydrogens summed into heavy atoms:
elementType: Br N N N N N C C C C C C C C
charge: -0.000087 -0.003365 0.006041 -0.100951 -0.024794 -0.024619 0.157484 0.009525 -0.020555 0.082665 0.161833 0.085547 -0.034191 -0.294533
polarizability: 1.97943218e+02 -7.84292116e+00 1.71509231e+02 4.19027892e-01 3.89718245e-02 7.65137080e+01
1716.lowfreq: -27.3368 -5.6845 0.0007 0.0008 0.0009 2.0489 6.1322 16.1247 46.4671
frequency: -26.6978 16.0107 46.4575 57.4390 80.8495 101.4790 119.7883 171.5653 180.7990 198.9283 211.0640 229.4134 236.7839 259.3816 265.3155 323.1625 345.0462 459.7584 536.6631 542.8989 551.2503 630.0177 633.6514 670.3464 701.5489 748.1989 790.0401 795.4966 818.6787 881.0649 881.6113 904.9329 932.5794 1012.9190 1052.9110 1079.0517 1112.1670 1128.3765 1145.0586 1149.1346 1151.3378 1199.3475 1208.8506 1238.9688 1260.9105 1283.5332 1298.0736 1327.6010 1351.3466 1373.1064 1375.4071 1395.0448 1399.5526 1469.6811 1474.6157 1478.0393 1478.6172 1481.3191 1483.1948 1494.8016 1498.5004 1510.0628 1539.8013 1595.8098 2973.1937 2981.2673 2983.1442 2986.3305 2990.3337 3013.6851 3031.6747 3040.8364 3078.4343 3082.1145 3085.2526 3095.8685 3559.1896 3561.2564
redmass: 1.9940 2.2665 2.6039 3.6864 2.9311 4.8563 3.4986 7.2051 4.7599 2.7516 1.2527 3.0743 9.4932 3.3537 1.4914 3.5926 4.6468 5.0655 4.5730 1.1992 1.1020 8.8455 8.4267 6.4546 10.0580 1.0874 6.0556 1.2116 5.7685 6.8689 1.1576 1.8498 2.1008 4.9236 3.1811 2.4047 3.4391 3.7110 1.5250 2.7683 1.7295 3.4436 3.9218 1.2159 1.1003 1.0824 1.4962 1.7281 1.7154 1.9770 2.1887 1.2302 1.2387 1.6522 1.0845 1.0402 1.0427 1.0756 1.1630 1.1252 1.0861 2.8070 7.6902 7.8482 1.0591 1.0445 1.0505 1.0379 1.0581 1.1011 1.1037 1.1045 1.1012 1.1013 1.0994 1.0984 1.0772 1.0773
irintensity: 0.1095 0.0674 0.2971 0.2270 3.0014 0.2366 1.0480 6.8293 1.0396 0.5279 0.1201 0.0890 13.0118 1.0623 0.5186 3.0511 0.5108 6.3156 4.5826 168.7523 2.1725 2.0748 20.1955 15.4790 0.0027 6.2410 34.1972 0.1755 65.9776 18.7665 2.5106 8.3271 18.5860 5.2186 5.4837 3.1914 16.2669 143.5000 2.1088 66.6159 12.2154 62.9026 8.7555 0.3238 0.0387 0.0848 96.4896 232.9282 77.1411 82.1649 142.6826 3.2569 28.6759 231.4441 13.9805 13.3702 13.8125 12.9548 11.3612 176.2330 6.6708 0.9931 1393.4219 392.8351 9.8374 8.4273 66.5128 29.9817 29.8838 0.4343 11.3835 29.6339 67.6637 50.5124 43.7005 29.0756 105.4530 39.6112
temp: 298.150 k
press: 1.00000 atm
elementType: 35 7 7 7 7 7 6 6 6 6 6 6 6 6 1 1 1 1 1 1 1 1 1 1 1 1 1 1
symmnumber: 1
zpe: 591146.3 jmol-1
zpe.correction: 0.225156 hartree
zpe.thermalcorrener: 0.240078 hartree
zpe.thermalcorrenthalpy: 0.241022 hartree
zpe.thermalcorrgfe: 0.180112 hartree
zpe.sumelectzpe: -599.411426 hartree
zpe.sumelectthermal: -599.396504 hartree
zpe.sumelectthermalent: -599.395560 hartree
zpe.sumelectthermalfe: -599.456469 hartree
dipole: -5.7021 2.4121 -0.0125
dipole: 6.1913
quadrupole: -91.4957 -77.0055 -94.4143
quadrupole: 6.6600 -0.0008 0.0593
quadrupole: -3.8572 10.6330 -6.7758 6.6600 -0.0008 0.0593
hfenergy: -599.6365817 hartree
pointgroup: C01 [X(C8H14Br1N5)]
dipole: 1.3278285 2.0421125 0.000145 debye
polarizability: 182.3859984|15.1900744|187.0674759|0.2212759|0.0100247|76.5126828 unknown
InChI: InChI=1S/C8H14BrN5/c1-3-5-11-8-13-6(9)12-7(14-8)10-4-2/h10-11H,3-5H2,1-2H3
charge 0 multiplicity 1
28 atoms
Br -2.588449 -3.585039 0.003436
N  1.84099 -0.935053 0.016975
N  -2.149658 1.558492 0.003132
N  -0.104197 0.391532 0.01384
N  -0.208641 -2.059367 0.01077
N  -2.262048 -0.776513 0.003489
C  2.73828 0.231743 0.023828
C  4.211447 -0.216657 -0.029894
C  5.173212 0.990261 -0.023777
C  0.480631 -0.848726 0.014049
C  -1.493559 2.876916 0.006893
C  -1.475243 0.37333 0.007318
C  -2.545696 3.996951 -0.021615
C  -1.544505 -1.912959 0.005882
H  2.552175 0.837023 0.932904
H  2.499967 0.882142 -0.8399
H  4.378875 -0.822026 -0.942983
H  4.430227 -0.870582 0.838047
H  2.227128 -1.881009 0.021327
H  4.994113 1.645286 -0.896406
H  5.040905 1.599187 0.889679
H  6.226112 0.659483 -0.05982
H  -0.852765 2.963898 0.905183
H  -0.818854 2.950157 -0.867174
H  -3.169127 1.491218 -0.000225
H  -3.171025 3.938119 -0.931356
H  -3.207928 3.949788 0.862467
H  -2.048567 4.982003 -0.017472
