program: Gaussian 09
title: 000035106
version: EM64L-G09RevD.01
frameworkgroup: C1[X(C9H16BrN5)]
method: RPBEPBE
basis: SDD
operation: Freq
keyword: #p
keyword: freq=noraman
keyword: PBEPBE/SDD
title: #p freq=noraman PBEPBE/SDD
converged: YES YES NO NO
title: Mulliken charges:
elementType: Br N N N N N C C C C C C C C C H H H H H H H H H H H H H H H H
charge: -0.008689 -0.113614 -0.115037 -0.332557 -0.021552 -0.025203 -0.352633 -0.354527 0.143575 -0.662643 -0.661103 0.063812 -0.307348 -0.304562 -0.714315 0.251795 0.211367 0.265865 0.207270 0.212489 0.244728 0.215380 0.206168 0.253205 0.217987 0.230648 0.232148 0.337415 0.225205 0.224221 0.230507
chargesum: 0.00000
title: Mulliken charges with hydrogens summed into heavy atoms:
elementType: Br N N N N N C C C C C C C C C
charge: -0.008689 -0.113614 -0.115037 0.004857 -0.021552 -0.025203 0.110529 0.118608 0.143575 0.009953 0.016257 0.063812 0.155447 -0.304562 -0.034382
polarizability: 2.02311369e+02 -7.91550267e-01 1.91668204e+02 -1.14433084e+00 -5.59056775e-01 8.91652073e+01
1716.lowfreq: -1.3313 0.0003 0.0006 0.0007 4.9435 9.6789 33.4986 45.6695 49.0706
frequency: 33.2393 45.6391 49.0543 64.4340 78.1813 89.6435 99.2482 137.2875 168.0197 178.6239 203.6317 211.3242 219.4635 240.4725 265.9699 276.8410 306.3265 315.6750 374.2086 441.1393 498.2115 536.4972 537.6650 563.5940 632.2552 650.1534 700.4415 755.6108 776.8556 786.4542 787.5968 798.2394 864.5502 884.2708 937.1439 939.7007 992.2595 1041.7463 1075.5305 1079.8332 1086.0272 1099.5548 1143.1338 1145.3139 1172.4536 1188.2791 1230.2570 1242.7808 1259.9455 1309.2566 1310.1776 1328.8735 1350.6139 1361.7702 1375.3725 1382.8768 1385.5738 1400.3934 1422.8784 1456.6664 1458.2151 1467.3946 1469.2957 1478.3472 1480.9575 1481.6045 1483.3021 1497.0973 1507.7070 1541.5837 1590.6250 2984.7648 2985.1403 2986.0864 2987.1260 3005.1847 3011.2447 3028.2802 3071.6065 3072.2404 3081.6594 3086.8846 3089.4781 3095.7890 3101.7686 3103.8925 3562.0667
redmass: 2.5681 3.0625 2.8004 2.7339 3.2567 3.4074 3.8036 3.0564 5.4701 5.3007 3.1250 1.0576 1.4203 8.5785 1.4515 2.3755 2.9863 2.8624 2.5031 5.1560 4.3650 3.5112 1.1426 3.6746 9.7663 6.7174 10.5478 3.2225 1.2793 4.0457 1.6467 1.1224 3.1320 4.8645 2.0479 2.2885 3.6938 3.0161 2.1865 1.9863 2.3134 1.7902 3.7850 1.5670 2.7947 3.0122 2.7011 3.6627 1.1018 1.4697 1.4937 1.6659 1.2319 1.4346 1.8955 1.2189 1.2243 1.2455 3.1386 1.1608 1.1166 1.0449 1.0496 1.0404 1.0664 1.0584 1.0591 1.1113 2.6167 5.5028 6.5980 1.0359 1.0356 1.0470 1.0485 1.0645 1.0640 1.1037 1.0994 1.0992 1.1012 1.0981 1.0976 1.0985 1.1024 1.1025 1.0774
irintensity: 0.0273 0.1300 0.1084 0.0138 4.5907 0.3408 1.1263 0.7823 0.0668 1.7672 0.2691 0.7362 0.0170 14.1685 0.6316 0.6234 0.5300 0.4671 6.0889 8.0069 3.0766 2.6933 88.6599 0.6761 9.7567 4.0528 0.3297 32.9962 6.0688 33.7750 61.7735 2.4344 5.7188 21.8270 3.7374 20.2147 12.1232 33.9268 14.3304 28.3168 14.6770 16.6804 150.3730 8.6911 70.9294 14.4862 24.6380 51.0433 0.0972 33.3405 42.1798 250.8017 2.8995 126.6057 151.9459 10.0975 39.8919 51.9319 247.9316 74.1334 27.2186 1.5589 5.8405 13.4779 17.2131 6.4748 18.3549 101.7687 62.0234 1482.3104 253.4241 29.5295 28.6444 27.1740 29.4713 32.1271 56.4753 13.6405 22.2009 1.9614 47.4681 36.6038 28.2992 29.5971 13.0955 44.7932 76.0707
temp: 298.150 k
press: 1.00000 atm
elementType: 35 7 7 7 7 7 6 6 6 6 6 6 6 6 6 1 1 1 1 1 1 1 1 1 1 1 1 1 1 1 1
symmnumber: 1
zpe: 663918.9 jmol-1
zpe.correction: 0.252873 hartree
zpe.thermalcorrener: 0.269937 hartree
zpe.thermalcorrenthalpy: 0.270881 hartree
zpe.thermalcorrgfe: 0.205826 hartree
zpe.sumelectzpe: -638.629618 hartree
zpe.sumelectthermal: -638.612554 hartree
zpe.sumelectthermalent: -638.611610 hartree
zpe.sumelectthermalfe: -638.676665 hartree
dipole: -5.6050 1.5213 0.3033
dipole: 5.8157
quadrupole: -96.3942 -83.9266 -100.8541
quadrupole: 7.3706 -0.3443 -0.8223
quadrupole: -2.6693 9.7984 -7.1291 7.3706 -0.3443 -0.8223
hfenergy: -638.8824912 hartree
pointgroup: C01 [X(C9H16Br1N5)]
dipole: 0.4298182 -2.2374546 0.2103941 debye
polarizability: 193.0844493|-3.647574|200.6440835|1.5972336|-5.2388757|89.4162468 unknown
InChI: InChI=1S/C9H16BrN5/c1-4-11-8-12-7(10)13-9(14-8)15(5-2)6-3/h11H,4-6H2,1-3H3
charge 0 multiplicity 1
31 atoms
Br -0.535246 4.083554 -0.363671
N  -1.753941 -0.943082 0.000043
N  0.554331 -0.451606 0.067316
N  2.817965 0.191881 0.137086
N  -1.115019 1.323784 -0.151271
N  1.236313 1.897801 -0.086014
C  -1.448266 -2.383301 0.160314
C  -3.172156 -0.53215 -0.135242
C  -0.74874 -0.015258 -0.026883
C  -1.233693 -3.096678 -1.191748
C  -3.835868 -0.235247 1.225458
C  1.499683 0.532416 0.039979
C  3.300679 -1.191331 0.27737
C  -0.074366 2.171433 -0.175941
C  4.83689 -1.217689 0.327832
H  -0.538945 -2.47505 0.776173
H  -2.290304 -2.841481 0.711984
H  -3.209947 0.368547 -0.768376
H  -3.703005 -1.349381 -0.658876
H  -2.118285 -2.995994 -1.846772
H  -0.361507 -2.666042 -1.712248
H  -1.047349 -4.174569 -1.031101
H  -3.77934 -1.105575 1.905043
H  -3.339634 0.623177 1.709037
H  -4.90223 0.018079 1.081524
H  2.872109 -1.638305 1.195167
H  2.926477 -1.796351 -0.570505
H  3.481164 0.968307 0.107664
H  5.276133 -0.802326 -0.597781
H  5.220952 -0.638814 1.187952
H  5.194342 -2.256148 0.434389
