program: Gaussian 09
title: 000005541
version: EM64L-G09RevD.01
frameworkgroup: C1[X(C9H14O6)]
method: RPBEPBE
basis: SDD
operation: Freq
keyword: #pfreq=noraman
keyword: PBEPBE/SDD
title: #p freq=noraman PBEPBE/SDD
converged: YES YES NO NO
title: Mulliken charges:
elementType: O O O O O O C C C C C C C C C H H H H H H H H H H H H H H
charge: -0.258596 -0.257375 -0.265299 -0.248776 -0.244524 -0.241378 -0.040638 -0.305263 -0.305563 0.295319 0.300137 0.308338 -0.754901 -0.755763 -0.753328 0.263013 0.269187 0.231385 0.275275 0.241123 0.246884 0.252077 0.250192 0.250490 0.250098 0.247554 0.250487 0.251507 0.248336
chargesum: 0.00000
title: Mulliken charges with hydrogens summed into heavy atoms:
elementType: O O O O O O C C C C C C C C C
charge: -0.258596 -0.257375 -0.265299 -0.248776 -0.244524 -0.241378 0.222375 0.195309 0.210835 0.295319 0.300137 0.308338 -0.005748 -0.007621 -0.002997
polarizability: 1.30408946e+02 -4.53168676e+00 1.21463514e+02 -3.73643856e+00 -5.76815670e+00 1.00302766e+02
1716.lowfreq: -9.9632 -4.8422 -2.8700 0.0005 0.0008 0.0009 4.7146 17.8551 22.3071
frequency: -8.2443 17.8375 22.2892 29.9968 39.4078 40.8093 46.4411 51.3315 66.5608 113.4017 146.0012 174.7845 190.2640 194.7162 205.3013 246.8173 305.0087 388.9111 395.2213 434.3319 441.9258 555.8649 564.5383 566.1074 581.8737 603.2644 625.1425 642.9495 770.0432 824.3619 848.9121 902.7650 916.2223 927.3937 967.1059 992.2673 997.4830 1008.3654 1027.3039 1042.6570 1044.0263 1045.1957 1070.9602 1140.8065 1192.2080 1194.1692 1207.6258 1215.3687 1219.7384 1291.6366 1337.6059 1356.2561 1378.1428 1383.8315 1385.6392 1387.7085 1451.7007 1452.5299 1453.1617 1453.6346 1454.4782 1455.7041 1457.1526 1465.6109 1650.6885 1652.0817 1655.5614 3006.4981 3007.4422 3008.6865 3015.0540 3025.7392 3037.7142 3087.9606 3097.5253 3099.2954 3100.4953 3106.3911 3140.6210 3142.9494 3144.4135
redmass: 1.1252 8.4330 5.0677 5.5584 2.3629 1.1763 3.1187 1.2621 3.6864 4.1094 4.5096 4.3920 5.9786 4.8346 5.1686 3.3831 2.5603 3.2958 3.1003 2.8592 3.5830 3.5282 3.0838 3.1525 4.4244 5.3057 4.1248 4.4071 3.5347 5.3748 4.6719 3.5028 2.7336 4.4563 3.1167 1.8594 1.8262 2.4026 2.7441 1.6747 1.6658 1.6538 2.5865 1.7970 3.2286 3.3615 1.1296 3.8162 1.1717 1.4603 1.3130 1.4346 1.4608 1.2504 1.2532 1.3588 1.0672 1.0615 1.0511 1.0555 1.0621 1.0517 1.0581 1.0756 9.7485 9.4350 9.6773 1.0385 1.0382 1.0370 1.0609 1.0607 1.0835 1.1050 1.0968 1.0950 1.0937 1.1037 1.1026 1.1019 1.1012
irintensity: 1.3101 1.8826 1.7438 0.9057 1.6205 0.9583 1.2070 0.1080 0.5097 4.0936 1.2593 14.7281 8.6217 6.1562 2.8456 6.2594 3.8853 7.1380 8.2963 4.5087 22.5033 3.0865 3.9934 3.4802 3.6356 12.3156 1.9026 2.1804 16.3844 16.0961 21.3743 42.8891 39.7729 61.0595 27.3773 87.0527 51.3694 107.8725 50.7121 7.8874 10.2073 14.0113 37.7531 15.2239 489.4341 566.4921 8.6398 30.9583 1.9531 3.1798 2.7952 1.7229 8.0086 40.7914 70.2087 44.8478 18.7174 5.8085 18.8386 34.8816 30.3630 13.6885 15.4794 13.3801 342.2043 24.7519 215.7198 1.9374 1.2975 1.6341 9.1182 18.5154 9.7526 11.3236 6.7700 7.5000 8.1595 12.2805 8.3701 8.8312 9.2960
temp: 298.150 k
press: 1.00000 atm
elementType: 8 8 8 8 8 8 6 6 6 6 6 6 6 6 6 1 1 1 1 1 1 1 1 1 1 1 1 1 1
symmnumber: 1
zpe: 588502.8 jmol-1
zpe.correction: 0.224149 hartree
zpe.thermalcorrener: 0.241653 hartree
zpe.thermalcorrenthalpy: 0.242598 hartree
zpe.thermalcorrgfe: 0.173229 hartree
zpe.sumelectzpe: -801.535402 hartree
zpe.sumelectthermal: -801.517897 hartree
zpe.sumelectthermalent: -801.516953 hartree
zpe.sumelectthermalfe: -801.586322 hartree
dipole: -1.4466 0.6580 2.2389
dipole: 2.7456
quadrupole: -85.4632 -94.3573 -87.4413
quadrupole: -7.1387 10.4489 8.9767
quadrupole: 3.6241 -5.2700 1.6460 -7.1387 10.4489 8.9767
hfenergy: -801.7595508 hartree
pointgroup: C01 [X(C9H14O6)]
dipole: 0.4374338 -0.3695872 0.9159017 debye
polarizability: 126.9481909|-6.1839307|124.5872444|6.6431284|3.5443215|100.6397902 unknown
InChI: InChI=1S/C9H14O6/c1-6(10)13-4-9(15-8(3)12)5-14-7(2)11/h9H,4-5H2,1-3H3
charge 0 multiplicity 1
29 atoms
O  -0.273984 -1.295213 0.558043
O  2.29683 -0.08237 -0.183038
O  -1.747247 1.268831 0.106233
O  -0.866996 -2.967474 -0.958783
O  3.335478 1.834079 0.637152
O  -3.574316 1.930605 -1.176687
C  -0.063986 -0.352953 -0.581392
C  0.998221 0.638923 -0.126698
C  -1.379984 0.315779 -0.974352
C  -0.659416 -2.602817 0.22033
C  3.412957 0.645308 0.255001
C  -2.905441 2.029322 -0.125102
C  -0.765313 -3.454335 1.464024
C  4.658285 -0.211628 0.215975
C  -3.201157 2.919783 1.059765
H  0.290482 -0.940026 -1.449498
H  0.810216 0.992572 0.899472
H  1.040125 1.51522 -0.79888
H  -2.183266 -0.428785 -1.104281
H  -1.268042 0.872152 -1.923614
H  -1.191155 -4.434867 1.207853
H  0.236693 -3.5936 1.907135
H  -1.391632 -2.95296 2.220806
H  4.591796 -0.972551 -0.576496
H  4.771287 -0.7344 1.183553
H  5.542227 0.426904 0.067118
H  -2.272845 3.343279 1.475185
H  -3.682631 2.324545 1.856895
H  -3.888386 3.722776 0.755782
