program: Gaussian 09
title: 000035120
version: EM64L-G09RevD.01
frameworkgroup: C1[X(C21H17N5O)]
method: RPBEPBE
basis: SDD
operation: Freq
keyword: #p
keyword: freq=noraman
keyword: PBEPBE/SDD
title: #p freq=noraman PBEPBE/SDD
converged: YES YES NO NO
title: Mulliken charges:
elementType: O N N N N N C C C C C C C C C C C C C C C C C C C C C H H H H H H H H H H H H H H H H H
charge: -0.268384 -0.413965 -0.415288 -0.163282 -0.090321 -0.134278 0.457154 0.455979 0.093509 0.020603 -0.453453 -0.323931 -0.449714 -0.332234 0.011695 0.424598 -0.199807 -0.224295 -0.197847 -0.217265 -0.257050 -0.256609 -0.356919 -0.357486 -0.198758 -0.198633 -0.246551 0.327297 0.338329 0.222011 0.321277 0.225474 0.298894 0.226563 0.227323 0.227306 0.222510 0.228240 0.228905 0.252516 0.252658 0.231005 0.231008 0.231217
chargesum: 0.00000
title: Mulliken charges with hydrogens summed into heavy atoms:
elementType: O N N N N N C C C C C C C C C C C C C C C C C C C C C
charge: -0.268384 -0.086668 -0.076959 -0.163282 -0.090321 -0.134278 0.457154 0.455979 0.093509 0.020603 -0.231441 -0.002654 -0.224241 -0.033341 0.011695 0.424598 0.026756 0.003028 0.029459 0.005245 -0.028810 -0.027704 -0.104403 -0.104827 0.032248 0.032374 -0.015334
polarizability: 4.61386622e+02 2.41523967e+01 2.82606938e+02 -1.26442604e-01 6.52509678e-01 1.39802987e+02
1716.lowfreq: -19.1328 -6.7517 -3.5538 -0.0009 -0.0008 -0.0003 4.0924 14.4336 30.3243
frequency: -19.1154 13.4667 30.3083 35.8187 38.3781 49.7323 57.3033 69.0941 110.4312 169.5010 176.7843 182.8855 183.8796 205.3979 234.0280 263.9110 278.1478 294.2999 351.2858 386.5486 398.2331 408.9530 409.2875 409.6052 469.1385 509.2430 510.7933 574.9786 585.7507 591.0285 610.0121 613.0190 614.2332 645.3262 650.8008 656.2592 665.2101 692.8918 694.7112 697.0613 707.5508 728.3086 738.8877 766.9527 768.0046 772.4554 790.5727 813.3022 829.9301 835.8587 843.9947 845.0344 853.0530 897.8755 915.4652 916.1920 919.6695 969.1098 973.2309 974.0532 984.5279 985.2227 988.4451 991.4597 998.0245 1006.6106 1015.0851 1020.6769 1024.1996 1033.6811 1045.3844 1072.2293 1088.4494 1091.3509 1158.8925 1170.2245 1171.2451 1171.4978 1178.9645 1187.4054 1188.5541 1221.6490 1234.0555 1266.9941 1272.1199 1303.3428 1318.0237 1328.3731 1345.5838 1377.5720 1382.3423 1392.4176 1417.9137 1438.9644 1439.3390 1451.4674 1470.3700 1481.0260 1484.2062 1497.8630 1517.2246 1543.2993 1576.3488 1600.4747 1601.5885 1604.4684 1606.4991 1615.9326 1618.2730 3110.7651 3113.6872 3130.4552 3131.2115 3132.3095 3143.4452 3143.8118 3143.9805 3157.7744 3164.7811 3165.3592 3168.3157 3176.0163 3192.4547 3196.5233 3516.9378 3526.5841
redmass: 3.8964 5.2397 4.0390 3.9788 5.6968 5.3182 5.7239 5.8243 5.8491 6.9753 7.5852 6.1223 8.7796 4.8334 5.1369 4.8208 4.5804 5.7803 7.4615 6.4164 8.8305 2.9177 2.9236 2.9081 4.0026 2.8695 2.8970 7.8649 8.0287 6.1638 6.5313 6.4426 6.4662 6.2447 1.9650 6.6191 2.3860 1.9866 1.9034 1.9598 2.2396 2.1968 7.3318 1.7841 1.6861 1.8101 6.0291 5.9501 7.1766 1.2481 1.2712 1.2720 4.9106 12.2769 1.4653 1.4394 1.4177 1.3759 1.3517 1.3446 6.1606 6.2079 6.0045 1.3288 1.3059 1.3034 3.2896 2.4780 2.4941 2.7332 3.4648 1.5027 1.5910 1.6690 1.9396 1.0550 1.0578 1.0542 1.5830 1.1118 1.1249 3.1181 2.4609 5.1828 4.3923 1.3236 1.5726 1.6085 2.8125 4.6534 10.0607 7.7210 2.8637 2.2082 2.5983 2.6612 2.3321 2.5046 2.3764 5.0707 4.1931 2.2725 6.0744 4.8532 5.5448 6.9240 4.4140 6.1442 6.1194 1.0885 1.0885 1.0870 1.0868 1.0851 1.0895 1.0934 1.0934 1.0937 1.0999 1.1000 1.0966 1.1008 1.0952 1.0944 1.0751 1.0750
irintensity: 0.1209 0.5913 0.2452 0.1201 0.2044 0.0112 0.2556 0.1246 0.7197 0.0607 0.0446 1.4193 0.0374 1.2374 2.4260 0.0038 3.1875 3.1792 0.3057 2.8078 1.6570 0.0035 0.0008 0.0599 7.5639 0.3734 36.5926 20.2410 11.1631 5.9136 0.2138 4.8374 2.7959 1.9295 0.7706 6.0572 29.3113 38.0936 14.8643 26.6733 69.0925 0.1886 2.3462 141.2440 1.1528 81.9969 104.6140 2.0406 20.3558 0.0861 2.8800 0.3647 6.2534 2.0886 6.0334 12.9832 10.3099 0.1319 0.0009 0.0235 1.0946 0.4139 15.7658 0.5887 2.4889 1.4753 9.1517 7.2493 12.7085 56.8134 1.1567 11.4959 2.8793 24.5944 150.5177 0.0482 0.1329 0.0808 139.9470 5.1369 0.6543 28.1810 21.3672 8.1303 190.3729 0.1000 42.2122 178.4298 499.9338 103.8099 0.6459 100.2839 266.2472 4.6863 227.2145 227.4740 51.6537 89.4177 173.1883 1149.4200 1469.3893 481.2146 143.7389 97.3827 8.1280 5.4740 82.3498 24.4297 45.2239 13.1706 12.5210 0.8507 0.6722 0.2923 10.5963 25.3685 33.2574 28.4425 31.4944 29.0559 11.8790 5.0821 15.7840 14.0908 52.0041 26.7603
temp: 298.150 k
press: 1.00000 atm
elementType: 8 7 7 7 7 7 6 6 6 6 6 6 6 6 6 6 6 6 6 6 6 6 6 6 6 6 6 1 1 1 1 1 1 1 1 1 1 1 1 1 1 1 1 1
symmnumber: 1
zpe: 889372.8 jmol-1
zpe.correction: 0.338744 hartree
zpe.thermalcorrener: 0.359656 hartree
zpe.thermalcorrenthalpy: 0.360600 hartree
zpe.thermalcorrgfe: 0.285869 hartree
zpe.sumelectzpe: -1157.583113 hartree
zpe.sumelectthermal: -1157.562202 hartree
zpe.sumelectthermalent: -1157.561258 hartree
zpe.sumelectthermalfe: -1157.635989 hartree
dipole: 0.4390 1.9604 0.0185
dipole: 2.0090
quadrupole: -126.7051 -148.9370 -157.2368
quadrupole: 0.9419 0.0148 0.0972
quadrupole: 17.5878 -4.6440 -12.9438 0.9419 0.0148 0.0972
hfenergy: -1157.9218577 hartree
pointgroup: C01 [X(C21H17N5O1)]
dipole: -0.1865315 0.7670492 -0.0397778 debye
polarizability: 462.1922733|-20.9531819|281.4857931|0.0517798|-6.6901731|140.1184809 unknown
InChI: InChI=1S/C21H17N5O/c1-4-10-16(11-5-1)22-19-24-20(23-17-12-6-2-7-13-17)26-21(25-19)27-18-14-8-3-9-15-18/h1-15,22-23H
charge 0 multiplicity 1
44 atoms
O  -1.106303 -2.719818 0.148926
N  -0.215825 1.933642 -0.05893
N  3.256232 -1.245388 0.072036
N  1.533921 0.421275 0.003318
N  1.069628 -1.974613 0.111169
N  -0.76787 -0.387981 0.044623
C  -1.500909 2.542554 -0.082144
C  4.448337 -0.476866 0.03102
C  0.166588 0.611975 -0.001455
C  1.926049 -0.883802 0.059995
C  -1.528112 3.963876 -0.144203
C  -2.722367 1.817782 -0.047732
C  5.674369 -1.19881 0.067349
C  4.474133 0.941392 -0.044378
C  -0.236766 -1.640813 0.09919
C  -2.522208 -2.47633 0.132418
C  -2.756978 4.651998 -0.171109
C  -3.944246 2.523848 -0.075285
C  6.905045 -0.515084 0.028945
C  5.716127 1.610951 -0.082057
C  -3.976639 3.935817 -0.13676
C  6.935876 0.897506 -0.046283
C  -3.195883 -2.463523 -1.103746
C  -3.208197 -2.369092 1.357083
C  -4.602798 -2.328512 -1.109618
C  -4.615184 -2.234848 1.338523
C  -5.313974 -2.212432 0.10827
H  0.588399 2.566451 -0.087921
H  3.366406 -2.262938 0.118373
H  -0.586315 4.527529 -0.171446
H  -2.697349 0.728285 -0.001091
H  5.660038 -2.294853 0.125581
H  3.530087 1.486518 -0.071414
H  -2.760932 5.746538 -0.218858
H  -4.880758 1.955246 -0.048115
H  7.839562 -1.086153 0.057708
H  5.7270 2.705424 -0.140419
H  -4.932352 4.470105 -0.157741
H  7.892525 1.429476 -0.07627
H  -2.62788 -2.559839 -2.03403
H  -2.649311 -2.393575 2.297506
H  -5.140512 -2.317303 -2.063845
H  -5.162338 -2.150916 2.283707
H  -6.404715 -2.1124 0.098907
