program: Gaussian 09
title: 000039648
version: EM64L-G09RevD.01
frameworkgroup: C1[X(C21H30N2O)]
method: RPBEPBE
basis: SDD
operation: Freq
keyword: #p
keyword: freq=noraman
keyword: PBEPBE/SDD
title: #p freq=noraman PBEPBE/SDD
converged: YES YES NO NO
title: Mulliken charges:
elementType: O N N C C C C C C C C C C C C C C C C C C C C C H H H H H H H H H H H H H H H H H H H H H H H H H H H H H H
charge: -0.274552 -0.116407 -0.080608 -0.432772 -0.343780 -0.365139 -0.345596 -0.384264 -0.311170 0.080222 -0.342701 0.316386 -0.683829 -0.700332 -0.697707 -0.587475 -0.398124 0.372409 0.384919 -0.427620 -0.416948 -0.409331 -0.243007 -0.239215 0.251890 0.228515 0.202962 0.207041 0.248372 0.196111 0.231931 0.186877 0.220358 0.212314 0.189352 0.216237 0.188569 0.203956 0.223000 0.221363 0.216405 0.226726 0.214060 0.214528 0.217310 0.215901 0.209106 0.268057 0.257445 0.238309 0.243292 0.238757 0.229329 0.228568
chargesum: 0.00000
title: Mulliken charges with hydrogens summed into heavy atoms:
elementType: O N N C C C C C C C C C C C C C C C C C C C C C
charge: -0.274552 -0.116407 -0.080608 0.047633 0.066222 0.079344 0.073213 0.048408 0.094419 0.080222 0.049823 0.316386 -0.023060 -0.045017 -0.055390 -0.319418 -0.140680 0.372409 0.384919 -0.189311 -0.173655 -0.170575 -0.013678 -0.010647
polarizability: 3.47964759e+02 -3.43473123e+00 2.00216090e+02 2.76493189e+00 3.57603173e+00 2.17335942e+02
1716.lowfreq: -16.0159 -5.2918 -0.0006 -0.0002 0.0005 4.2583 7.5850 9.5230 19.2669
frequency: -10.6048 7.6531 19.1439 30.2153 35.3519 46.8281 53.2721 59.5323 73.4709 79.7922 99.7238 101.8803 134.8662 154.1479 172.2368 193.8565 198.3522 211.7020 222.3831 230.3319 250.5164 267.4334 278.3384 291.7482 314.9587 355.9317 372.3726 386.0232 396.7533 420.7318 444.0244 477.3711 482.7755 487.7478 510.9369 524.6022 558.2545 586.7319 625.8643 654.5725 690.8376 718.3350 733.5489 751.8032 759.2294 764.9107 772.1771 775.2778 786.5133 789.0194 804.4754 829.4184 840.6516 879.7164 894.0220 898.4572 911.6588 925.7645 934.1227 960.9840 964.4247 975.3631 980.8575 993.9445 1019.1141 1021.2073 1024.0012 1043.3759 1056.7310 1070.4175 1073.6649 1082.1459 1094.1799 1109.1353 1112.6190 1123.6288 1133.0230 1161.1954 1172.9831 1188.4897 1197.9002 1205.4477 1226.3005 1239.6796 1247.0494 1259.5361 1266.1396 1275.1895 1277.6915 1286.4552 1292.7247 1306.6091 1317.9654 1335.6626 1340.8222 1343.0398 1348.0613 1362.8171 1371.4272 1371.5704 1379.6468 1386.3520 1389.5609 1395.8914 1409.3523 1421.0775 1431.6990 1444.8171 1457.5478 1462.8796 1465.6449 1466.7089 1469.4115 1473.4161 1475.1898 1476.5653 1477.4172 1481.1612 1486.1498 1488.9593 1498.1162 1508.4562 1550.3993 1578.5599 1602.4256 1639.5152 2868.9145 2891.8419 2963.5895 2973.3505 2975.4605 2978.1587 2983.7649 2989.7060 2996.5115 3010.1217 3017.1612 3023.0823 3026.3461 3039.1860 3039.5316 3065.5260 3071.8493 3073.5423 3073.9737 3077.4063 3081.1098 3088.8203 3100.7320 3120.2002 3121.1200 3126.9572 3138.5220 3143.5842 3145.6823 3162.5745
redmass: 3.2741 3.3137 4.2680 4.0279 3.1597 1.8695 3.4449 2.9605 3.8882 2.9816 2.5661 2.8746 4.5454 1.5699 3.0066 3.4517 3.8923 1.1820 1.1806 2.7543 2.5658 2.4244 2.0804 2.8013 3.6037 4.0145 2.5204 3.4855 2.6378 3.1400 3.2830 2.7075 2.9120 2.7894 6.7898 4.4311 3.8948 5.1757 6.3316 3.8179 4.0975 3.2577 1.1184 2.5325 2.8809 1.8405 1.1277 1.2501 2.6483 1.2643 1.2096 3.0136 1.5968 1.5779 2.0717 1.8281 1.9839 1.5738 2.2193 2.6928 1.4255 2.4499 1.3751 1.3445 3.7552 2.9876 2.7932 2.0518 2.0454 2.3013 2.4463 2.1300 1.9097 1.7669 2.3563 1.7691 1.6720 1.2704 1.0837 1.8027 2.2896 2.0549 2.1647 1.8266 1.6129 1.5470 1.3109 1.7757 1.1512 1.1059 1.2178 1.3768 1.2788 1.3323 1.2365 1.4743 1.7734 1.3906 1.2758 1.3332 1.2378 1.2595 1.2353 2.4531 4.0187 3.0766 4.1331 1.1241 1.0997 1.5973 1.0514 1.0951 1.3093 1.0887 1.1134 1.0435 1.0872 1.0516 1.0803 1.0767 1.0782 3.5826 6.4706 7.2667 5.6301 6.8449 1.0713 1.0693 1.0589 1.0415 1.0573 1.0351 1.0376 1.0597 1.0607 1.0961 1.0862 1.0756 1.0792 1.1005 1.1001 1.1040 1.1007 1.0990 1.1011 1.0992 1.1006 1.1005 1.1005 1.0865 1.0862 1.0886 1.0920 1.0950 1.0971 1.1004
irintensity: 0.0320 0.2960 0.0828 0.8517 0.1323 0.0378 0.8803 0.7753 1.2154 0.9595 0.2516 0.1713 0.5608 1.1228 1.4504 2.0102 0.0654 0.2458 0.1107 0.9470 0.8123 2.4655 2.0846 0.6854 4.1153 5.4617 6.3249 0.7952 1.9336 3.3374 7.3730 14.1820 12.1949 11.6526 0.3814 12.8531 3.9851 5.8257 2.5706 0.9467 7.7222 4.5148 12.0201 8.6724 11.0186 34.8219 4.5301 10.7997 0.4747 3.5822 6.3020 36.6699 22.8655 27.7678 5.3190 5.1329 2.5846 17.0067 8.2045 1.3333 6.7826 7.5255 3.7210 0.0235 3.5380 4.5444 3.0045 20.7507 4.1466 36.7410 1.2993 19.2036 9.3025 35.3446 19.3034 4.0440 46.9597 6.4708 0.5924 81.4543 8.7392 45.4723 14.5157 12.5342 8.4191 2.0939 0.5249 7.3829 6.8207 7.5543 46.0005 47.5116 5.5125 5.0896 13.9941 0.7287 3.6370 19.3284 8.7008 11.5236 16.0729 26.7267 14.1127 107.0332 25.0489 1.6905 3.1985 16.1256 10.4484 7.3431 15.0325 1.6134 23.4449 11.9423 9.8062 11.7951 7.3011 6.3675 18.5361 17.0945 1.1590 8.0211 210.8695 10.0024 5.7486 1.1395 57.9601 67.7641 25.9663 27.2515 38.3623 25.7872 22.5216 50.5005 44.0926 10.7489 18.3593 18.3800 38.0115 17.8970 7.1623 0.9023 75.6745 35.6987 87.8263 63.0347 45.2708 38.7109 33.2332 0.7615 7.0758 0.3520 2.3704 29.4879 19.1970 37.3436
temp: 298.150 k
press: 1.00000 atm
elementType: 8 7 7 6 6 6 6 6 6 6 6 6 6 6 6 6 6 6 6 6 6 6 6 6 1 1 1 1 1 1 1 1 1 1 1 1 1 1 1 1 1 1 1 1 1 1 1 1 1 1 1 1 1 1
symmnumber: 1
zpe: 1221334.5 jmol-1
zpe.correction: 0.465182 hartree
zpe.thermalcorrener: 0.490073 hartree
zpe.thermalcorrenthalpy: 0.491017 hartree
zpe.thermalcorrgfe: 0.406536 hartree
zpe.sumelectzpe: -1001.141924 hartree
zpe.sumelectthermal: -1001.117033 hartree
zpe.sumelectthermalent: -1001.116089 hartree
zpe.sumelectthermalfe: -1001.200569 hartree
dipole: -0.2478 3.6704 1.5616
dipole: 3.9965
quadrupole: -128.4257 -154.8310 -142.4044
quadrupole: 2.7533 0.0976 -8.3334
quadrupole: 13.4613 -12.9440 -0.5174 2.7533 0.0976 -8.3334
hfenergy: -1001.6071056 hartree
pointgroup: C01 [X(C21H30N2O1)]
dipole: 0.4159206 1.360003 -0.6705721 debye
polarizability: 341.5874055|-30.3672086|206.3923706|0.1181144|-3.0697472|217.5370157 unknown
InChI: InChI=1S/C21H30N2O/c1-4-7-14-23(16-15-22(5-2)6-3)21(24)20-13-12-18-10-8-9-11-19(18)17-20/h8-13,17H,4-7,14-16H2,1-3H3
charge 0 multiplicity 1
54 atoms
O  -1.60685 -1.942131 1.590021
N  -1.937402 -0.131172 0.162218
N  -0.445134 3.334876 -0.407153
C  -1.403049 1.034452 -0.579009
C  -0.995035 2.20036 0.365644
C  -3.355012 -0.062943 0.603155
C  -4.276901 -0.962806 -0.250363
C  -0.883452 4.674136 0.058062
C  1.007207 3.196372 -0.687125
C  -1.154465 -1.154389 0.692792
C  -5.751081 -0.889549 0.206994
C  0.246907 -1.34329 0.157939
C  -0.325808 5.143533 1.430584
C  1.499452 4.10874 -1.825641
C  -6.679593 -1.787614 -0.63862
C  1.300571 -1.502832 1.064623
C  0.499141 -1.494073 -1.249418
C  2.633719 -1.769612 0.61562
C  2.885468 -1.904678 -0.806011
C  1.783648 -1.773167 -1.715043
C  3.72863 -1.917383 1.531453
C  4.219331 -2.179172 -1.25457
C  5.018015 -2.183566 1.065479
C  5.265884 -2.3148 -0.339185
H  -0.528897 0.735688 -1.176813
H  -2.172039 1.399422 -1.283266
H  -0.276623 1.804967 1.123468
H  -1.888516 2.540503 0.92287
H  -3.409949 -0.383097 1.659719
H  -3.68586 0.990685 0.539229
H  -3.915244 -2.005919 -0.175597
H  -4.201115 -0.665792 -1.316404
H  -0.61578 5.415835 -0.717313
H  -1.989651 4.661986 0.100859
H  1.626713 3.374049 0.227452
H  1.188673 2.143987 -0.976308
H  -6.10437 0.161257 0.154712
H  -5.816074 -1.189629 1.272456
H  -0.59629 4.437449 2.237381
H  0.775223 5.23751 1.413931
H  -0.743344 6.133657 1.692598
H  0.890505 3.94927 -2.733133
H  1.443813 5.178794 -1.555833
H  2.554666 3.881667 -2.064286
H  -6.364985 -2.846247 -0.579105
H  -7.727503 -1.726085 -0.29189
H  -6.657432 -1.490428 -1.704173
H  1.094014 -1.439708 2.139215
H  -0.338041 -1.425614 -1.953629
H  1.962864 -1.904239 -2.788911
H  3.53619 -1.821147 2.606646
H  4.406843 -2.283211 -2.330133
H  5.847022 -2.295877 1.772741
H  6.281995 -2.524824 -0.690929
