program: Gaussian 09
title: 000035071
version: EM64L-G09RevD.01
frameworkgroup: C1[X(C9H9ClN6)]
method: RPBEPBE
basis: SDD
operation: Freq
keyword: #p
keyword: freq=noraman
keyword: PBEPBE/SDD
title: #p freq=noraman PBEPBE/SDD
converged: NO YES NO NO
title: Mulliken charges:
elementType: Cl N N N N N N C C C C C C C C C H H H H H H H H H
charge: -0.076138 -0.410045 -0.157831 -0.165777 -0.136415 -0.588903 -0.588625 0.551149 0.110016 -0.361756 -0.305896 -0.223299 -0.230583 -0.246834 0.051055 0.086079 0.336296 0.314880 0.253011 0.225770 0.232783 0.333190 0.334157 0.334100 0.329616
chargesum: 0.00000
title: Mulliken charges with hydrogens summed into heavy atoms:
elementType: Cl N N N N N N C C C C C C C C C
charge: -0.076138 -0.073749 -0.157831 -0.165777 -0.136415 0.078444 0.075092 0.551149 0.110016 -0.361756 0.008984 0.029712 -0.004813 -0.014051 0.051055 0.086079
polarizability: 2.46270375e+02 -1.57806527e+01 1.85689998e+02 -1.81645106e-02 -3.91514686e-03 5.85396757e+01
1716.lowfreq: -7.6323 -1.5059 -0.0024 -0.0009 0.0009 4.3691 32.0913 54.6746 91.6708
frequency: 32.0357 54.6729 91.6683 140.0361 174.8356 183.6748 191.2622 206.1512 244.6140 289.7743 317.5391 379.1314 391.0910 439.7540 467.2537 470.2593 480.5593 538.2447 539.7864 541.9150 556.2528 577.3221 614.8996 673.8701 679.5926 707.7349 719.6770 731.8479 750.9563 758.4458 798.8881 831.0088 869.9923 901.6187 937.4241 944.0152 995.8746 1004.1822 1015.3143 1040.2303 1109.1904 1125.9724 1135.9449 1168.8068 1233.6079 1274.7660 1305.9794 1345.4674 1390.8369 1427.1391 1440.5278 1465.3167 1495.0822 1502.2334 1532.7034 1550.9870 1579.0528 1597.8079 1615.1444 1637.6613 3137.6951 3157.0793 3175.9880 3183.2962 3484.0899 3558.2681 3560.0965 3718.8530 3719.3184
redmass: 6.2130 5.5352 6.4192 5.1827 10.8987 6.6808 7.8608 5.6826 5.4276 5.0176 2.9707 6.3846 8.4223 3.4110 1.2001 3.2411 1.2213 2.3314 1.2313 1.0608 8.2308 7.5668 6.1141 7.1203 2.9382 9.2650 5.0144 5.9643 1.3807 1.4837 6.9727 5.2895 1.3451 13.1650 2.1782 1.3525 1.3071 5.9047 3.6670 1.9915 2.3011 2.3068 1.9403 1.0674 1.8719 3.9346 2.0944 3.0637 5.4691 3.7253 3.0191 2.5481 2.6823 6.4559 3.0276 2.7225 3.6861 1.4551 4.5247 2.6574 1.0867 1.0916 1.0966 1.0968 1.0749 1.0440 1.0445 1.1059 1.1058
irintensity: 0.0579 1.4962 0.8876 0.1377 2.1135 5.7375 0.1611 7.8532 2.2206 7.3584 7.6970 3.6764 5.9248 4.5461 50.5866 0.1427 523.5745 15.2780 12.3700 2.7069 5.5597 13.9983 1.5255 27.4525 22.7906 0.2838 0.1708 0.4763 3.2197 114.7852 90.6277 0.0947 4.9769 0.7509 6.2513 5.5267 3.5197 34.2767 23.0642 15.4107 1.4244 0.3327 2.7566 0.7560 12.4285 12.7916 2.6738 23.0107 96.8882 142.1827 41.1742 169.2968 47.3734 1799.3324 252.4290 386.5946 141.3846 658.2563 208.8618 27.1780 6.1296 12.3390 2.8470 32.3307 69.6541 142.4413 77.9784 34.3268 59.3171
temp: 298.150 k
press: 1.00000 atm
elementType: 17 7 7 7 7 7 7 6 6 6 6 6 6 6 6 6 1 1 1 1 1 1 1 1 1
symmnumber: 1
zpe: 483963.1 jmol-1
zpe.correction: 0.184332 hartree
zpe.thermalcorrener: 0.198101 hartree
zpe.thermalcorrenthalpy: 0.199045 hartree
zpe.thermalcorrgfe: 0.143094 hartree
zpe.sumelectzpe: -1135.843280 hartree
zpe.sumelectthermal: -1135.829511 hartree
zpe.sumelectthermalent: -1135.828567 hartree
zpe.sumelectthermalfe: -1135.884518 hartree
dipole: 2.1152 1.6379 0.0054
dipole: 2.6753
quadrupole: -79.1033 -81.8867 -105.5888
quadrupole: -4.9738 -0.0122 -0.0320
quadrupole: 9.7563 6.9729 -16.7292 -4.9738 -0.0122 -0.0320
hfenergy: -1136.0276117 hartree
pointgroup: C01 [X(C9H9Cl1N6)]
dipole: 0.7551913 -0.7325818 -0.0287611 debye
dipolederiv: -0.1622614 -0.0388233 -0.0001198 0.0584279 -0.7538487 -0.0196103 0.0025642 -0.0180832 -0.0662881 -2.4899748 -0.0140608 0.0213176 0.190348 -0.3230579 -0.0026581 0.0299723 -0.0014283 -0.3301036 -2.1501519 -0.2896965 0.0132538 -0.2847858 -0.6981767 -0.0068081 0.014556 -0.0070703 -0.245843 -1.445121 0.4467637 0.0235723 0.7454171 -1.034429 -0.0272621 0.0323737 -0.0241735 -0.2126953 -0.9160339 -0.2685756 0.0007411 -0.1302025 -1.4254603 -0.0259245 0.0041898 -0.0249189 -0.2545925 -1.1620879 -0.6736371 -0.0116264 -0.8123642 -0.8113736 0.0061271 -0.0158991 0.0040656 -0.7223142 -0.3589016 0.2852307 0.0027546 0.5056715 -1.4272266 -0.0224171 0.008328 -0.0208331 -0.7139661 1.4985543 0.164129 -0.008467 0.8362339 -0.1195347 -0.0145381 0.0072223 -0.0075026 0.1219421 2.8488742 -0.0491083 -0.0307054 -0.6805809 1.0440361 0.0258785 -0.0507174 0.0197512 0.2109696 -0.261857 -0.0282321 0.0005897 -0.042852 1.058419 0.0327798 0.0005673 0.03169 -0.1173333 -0.3032954 0.0916063 0.0042856 -0.3791036 -0.0715613 0.0061459 -0.0085726 0.0011435 -0.1602051 0.0586814 0.0239748 -0.0005397 -0.048704 -0.1429019 -0.0008605 -0.00274 -0.0014108 -0.0871873 0.1051293 -0.0492067 -0.0038334 0.0973665 0.148887 0.0074282 0.0007016 0.009026 -0.149139 -0.132892 0.0170869 0.0000899 0.0136676 -0.077736 0.0030712 -0.0003902 0.0029563 -0.1922817 2.1651219 0.5833247 -0.0057896 0.4827979 1.4990949 0.025239 -0.0089812 0.0243261 0.2109801 1.4197089 -0.2124902 -0.0179947 -0.5301959 1.9838627 0.0475686 -0.026434 0.0452959 0.2104744 0.2520652 -0.0415702 -0.0006375 -0.0969035 0.2267711 -0.0005635 -0.0010013 -0.0005921 0.2954406 0.2304786 0.0396786 0.0003913 0.0824306 0.0440245 -0.004115 0.0015189 -0.0036633 0.1671147 -0.0007555 0.0673726 0.0034244 0.091095 0.0420917 -0.0043016 0.0040559 -0.0040067 0.1648804 0.0773766 -0.0077005 0.0004793 -0.0522221 -0.1195908 -0.0072613 -0.0007784 -0.0075864 0.1563092 -0.0960507 -0.0760496 0.0003605 -0.074878 0.0380343 -0.0030027 0.0004423 -0.0031056 0.1702284 0.2771883 0.0576764 0.0026103 0.0253508 0.1722385 -0.0054318 0.0025367 -0.005486 0.3882558 0.1908702 0.0380372 0.0029105 0.097754 0.2465213 -0.0042592 0.0044654 -0.0034244 0.3883708 0.2053084 -0.0670977 0.000331 -0.0523675 0.2357793 -0.0029942 0.0003885 -0.0025515 0.3876269 0.1500259 0.0013676 0.0026017 -0.0414005 0.2651371 -0.0022301 0.0016314 -0.0024179 0.3793559 unknown
polarizability: 248.9927539|8.7302557|182.8700756|-1.6990801|3.1174622|58.6372186 unknown
InChI: InChI=1S/C9H9ClN6/c10-5-3-1-2-4-6(5)13-9-15-7(11)14-8(12)16-9/h1-4,13H,11-12H2
charge 0 multiplicity 1
25 atoms
Cl -2.620802 2.799974 0.135635
N  -0.336971 0.826053 0.059913
N  1.916792 1.308994 0.041984
N  1.193485 -1.019856 -0.002379
N  3.580729 -0.478153 -0.016046
N  4.210004 1.776832 0.030466
N  2.829531 -2.692408 -0.060457
C  -1.58495 0.176444 0.053805
C  0.956065 0.324919 0.030725
C  -2.770748 0.965396 0.087237
C  -1.75187 -1.23772 0.015874
C  -4.05768 0.408491 0.083305
C  -3.040766 -1.807266 0.01168
C  -4.198917 -0.998054 0.045048
C  3.204826 0.844402 0.018319
C  2.530649 -1.354453 -0.025343
H  -0.357994 1.851751 0.085236
H  -0.848696 -1.849604 -0.00808
H  -4.93311 1.063405 0.109575
H  -3.138265 -2.897963 -0.018115
H  -5.198254 -1.444065 0.041805
H  5.176219 1.462102 0.012397
H  3.970119 2.764186 0.055584
H  3.804347 -2.979777 -0.077343
H  2.073759 -3.371632 -0.067525
