program: Gaussian 09
title: 000005673
version: EM64L-G09RevD.01
frameworkgroup: C1[X(C22H26N2O2)]
method: RPBEPBE
basis: SDD
operation: Freq
keyword: #p
keyword: freq=noraman
keyword: PBEPBE/SDD
title: #p freq=noraman PBEPBE/SDD
converged: YES YES NO NO
title: Mulliken charges:
elementType: O O N N C C C C C C C C C C C C C C C C C C C C C C H H H H H H H H H H H H H H H H H H H H H H H H H H
charge: -0.276785 -0.240509 -0.064954 -0.315323 0.367824 -0.305880 -0.476765 0.151433 -0.375294 -0.423172 -0.454730 -0.452303 0.116535 -0.386469 -0.541728 0.189424 0.166058 0.179587 -0.728493 0.132919 -0.437005 -0.299912 -0.252281 -0.255302 -0.215422 -0.673681 0.252757 0.230318 0.216463 0.215097 0.200481 0.214218 0.198692 0.230587 0.195933 0.224793 0.227827 0.278011 0.228870 0.222944 0.223967 0.230857 0.217474 0.233836 0.259607 0.219297 0.218339 0.230358 0.228615 0.213584 0.232163 0.227136
chargesum: 0.00000
title: Mulliken charges with hydrogens summed into heavy atoms:
elementType: O O N N C C C C C C C C C C C C C C C C C C C C C C
charge: -0.276785 -0.240509 -0.064954 -0.315323 0.367824 -0.053123 -0.029983 0.151433 0.040285 -0.010262 -0.028210 0.000317 0.116535 -0.108458 -0.089914 0.189424 0.166058 0.179587 -0.056195 0.132919 -0.203169 -0.040306 -0.032985 -0.036963 0.243552 -0.000798
polarizability: 2.90303018e+02 -4.16017992e+00 3.31084129e+02 3.89007142e+00 2.90675037e+00 1.66356732e+02
1716.lowfreq: -11.1374 -3.1412 -0.0009 -0.0005 0.0006 4.2894 22.4439 36.9912 55.2572
frequency: 22.2379 36.9722 55.2550 64.3907 65.0713 85.4441 96.8310 123.7843 132.3334 150.8161 171.5562 179.1039 187.1688 207.0042 229.5599 241.2894 244.6013 262.1719 281.3816 293.3915 314.6493 335.7730 343.1029 347.5163 359.5568 388.3391 425.3058 440.3190 448.9993 468.4859 473.6215 521.2660 532.5765 556.4471 572.8431 582.5581 595.5677 612.0996 638.0311 680.8339 709.7103 711.9481 737.8236 746.7407 751.6258 758.6095 779.1577 783.1093 798.3856 800.6225 824.1712 843.9270 850.3731 859.0347 892.2581 907.8813 911.8786 925.4385 930.5749 944.8612 965.3543 970.2735 982.5020 1006.6168 1022.4394 1024.1581 1025.8352 1038.5138 1046.8937 1053.7869 1071.5967 1089.8199 1111.5815 1112.6100 1124.3706 1128.8814 1135.5339 1143.4065 1158.0870 1173.6533 1178.7546 1187.0241 1191.3729 1213.2833 1228.4752 1247.8350 1248.5860 1259.0495 1279.5187 1280.9737 1295.3632 1298.1976 1312.8666 1319.4960 1327.2783 1330.5872 1334.0056 1343.4339 1353.2653 1356.7683 1369.3873 1391.6484 1392.7199 1400.6160 1402.7402 1418.1281 1452.5668 1454.1886 1458.2329 1461.3034 1463.5083 1464.4582 1467.3377 1472.6798 1473.5220 1473.8324 1475.5076 1486.7143 1487.6261 1575.6604 1595.1337 1608.8122 1617.2386 1634.1042 2877.0757 2953.4742 2960.5943 2974.1225 2978.8767 2979.8461 2986.8833 2995.9101 2998.0558 3008.6665 3009.5143 3018.1697 3037.0443 3045.2384 3053.5992 3061.2429 3067.0107 3072.5357 3077.1980 3092.3157 3107.1168 3123.0277 3136.4004 3156.7069 3161.8383 3200.2884
redmass: 3.4619 3.5485 2.6410 2.7552 3.2956 3.0996 3.5294 3.0543 3.0125 3.2796 2.7699 2.9796 3.1069 2.4763 2.7136 2.2819 1.4988 2.3007 4.3556 4.6890 3.1500 4.9060 3.5671 2.2570 2.7498 3.4393 2.9611 3.3521 3.9899 3.0728 3.6901 3.8824 5.1492 4.0503 3.8605 4.4028 3.2713 5.6604 6.2119 3.6556 3.9630 5.3146 2.9932 1.4634 4.0469 3.3570 2.1667 2.0271 1.4361 1.6695 2.5942 1.6930 1.4651 1.8118 3.0378 2.4124 2.7952 2.3404 1.3898 2.8613 3.2848 1.3427 3.7705 2.1213 2.2229 2.0564 2.1068 1.9347 2.0512 3.8406 2.5517 2.2255 2.5372 2.8794 2.2168 1.6966 1.4623 2.1751 2.0195 1.9066 1.4341 1.4902 1.5412 1.7272 2.0236 1.1858 1.5675 1.3591 1.4892 1.8181 1.3301 1.4059 1.6904 1.4985 1.5522 1.5804 1.4538 1.3893 1.3749 1.4086 1.4193 2.4900 1.2155 1.2752 6.0695 5.4339 3.0976 1.1097 1.0881 1.0844 1.0404 1.1256 1.0940 2.5910 1.0649 1.1611 1.0679 1.0705 1.0498 6.5497 9.2831 8.4526 9.7631 8.7042 1.0694 1.0813 1.0622 1.0626 1.0503 1.0473 1.0642 1.0358 1.0646 1.0582 1.0935 1.0876 1.1007 1.0965 1.1051 1.1017 1.1066 1.0985 1.1000 1.0985 1.1025 1.0853 1.0912 1.0982 1.0902 1.0941
irintensity: 0.3737 0.1349 0.1469 0.9771 1.1084 0.1870 0.2867 0.8040 1.8840 1.4395 2.2735 0.5888 1.5531 1.2392 1.3171 0.5409 1.0007 0.4741 0.6146 6.9007 1.1437 11.6377 0.2329 0.9935 5.2924 1.6151 4.3173 2.3628 5.0033 0.9837 2.5653 10.6441 4.7117 2.3107 4.1777 0.3845 8.3999 0.5188 0.1219 2.4235 6.9787 16.5875 4.4696 80.4152 1.3415 10.7549 2.9915 8.3051 0.9529 4.4172 9.4281 7.0802 2.2349 5.5082 4.2708 7.9369 1.2999 14.8810 1.5866 7.5047 35.6739 3.0089 13.5425 18.8166 37.7922 10.5119 16.5383 20.2257 9.1924 268.6482 0.7901 3.0927 16.5358 13.1126 17.0195 63.0033 5.3699 12.2242 68.1313 12.1845 93.6704 10.1808 63.8881 9.9619 16.1422 6.8356 63.8619 28.6924 19.7896 41.9841 1.6517 2.4092 21.4986 6.1964 10.1177 1.1440 2.6046 2.8136 4.0657 1.7523 2.5516 9.0859 22.9628 19.8587 14.3986 101.4602 90.6053 16.9799 17.2217 13.8341 12.3354 8.0460 5.5177 33.1520 3.9017 2.6061 8.3161 12.3024 12.8113 6.7597 148.0239 26.8987 135.0769 40.0707 54.8754 16.7560 42.6678 31.1005 31.8703 16.1188 46.7632 21.0841 30.6744 20.8946 47.3523 66.0554 40.2516 5.5182 44.1405 40.5617 7.6193 69.3329 48.2522 29.5737 40.3724 1.0910 20.7432 43.2864 1.3534 5.5540
temp: 298.150 k
press: 1.00000 atm
elementType: 8 8 7 7 6 6 6 6 6 6 6 6 6 6 6 6 6 6 6 6 6 6 6 6 6 6 1 1 1 1 1 1 1 1 1 1 1 1 1 1 1 1 1 1 1 1 1 1 1 1 1 1
symmnumber: 1
zpe: 1141469.8 jmol-1
zpe.correction: 0.434763 hartree
zpe.thermalcorrener: 0.457947 hartree
zpe.thermalcorrenthalpy: 0.458891 hartree
zpe.thermalcorrgfe: 0.382623 hartree
zpe.sumelectzpe: -1111.979120 hartree
zpe.sumelectthermal: -1111.955936 hartree
zpe.sumelectthermalent: -1111.954992 hartree
zpe.sumelectthermalfe: -1112.031260 hartree
dipole: 0.5535 -3.0488 1.3243
dipole: 3.3697
quadrupole: -130.2510 -154.2960 -156.7967
quadrupole: -6.1612 2.8274 2.4445
quadrupole: 16.8636 -7.1814 -9.6822 -6.1612 2.8274 2.4445
hfenergy: -1112.4138828 hartree
pointgroup: C01 [X(C22H26N2O2)]
dipole: 0.5183049 1.0952775 0.5379239 debye
polarizability: 300.0756359|17.976345|321.2717681|-4.6523776|2.2991806|166.396475 unknown
InChI: InChI=1S/C22H26N2O2/c1-3-22-11-7-12-23-13-10-16-15-8-5-6-9-17(15)24(19(16)20(22)23)18(14-22)21(25)26-4-2/h5-6,8-9,14,20H,3-4,7,10-13H2,1-2H3
charge 0 multiplicity 1
52 atoms
O  -2.678666 2.441345 0.353842
O  -3.232505 0.550085 -0.88812
N  3.199421 -0.321206 -0.169823
N  -0.563663 -0.539567 -0.125001
C  1.488277 1.542245 0.299361
C  1.8538 0.249043 -0.503516
C  1.796642 1.323106 1.824797
C  0.805995 -0.822438 -0.333273
C  3.441406 -0.506219 1.287391
C  3.234654 0.81114 2.053535
C  2.290301 2.77478 -0.227985
C  3.405525 -1.58879 -0.9325
C  1.032721 -2.18597 -0.345981
C  -0.005571 1.796952 0.166148
C  2.41887 -2.749116 -0.549849
C  -0.959529 0.821514 -0.004294
C  -0.246987 -2.824539 -0.0923
C  -1.239738 -1.783283 0.050353
C  1.992368 3.190164 -1.685616
C  -2.384904 1.203066 -0.231265
C  -0.626519 -4.182488 0.043495
C  -2.584716 -2.094747 0.342413
C  -1.970624 -4.492186 0.330599
C  -2.933588 -3.456079 0.481241
C  -4.05004 2.969985 0.080742
C  -4.146285 4.320424 0.782651
H  1.900288 0.533382 -1.575295
H  1.083607 0.580783 2.234944
H  1.619878 2.272381 2.365333
H  4.48241 -0.863364 1.403547
H  2.770213 -1.279004 1.735862
H  3.979149 1.55815 1.72282
H  3.400374 0.635101 3.133574
H  3.369762 2.558938 -0.134106
H  2.071627 3.630061 0.444082
H  4.450199 -1.918712 -0.781399
H  3.281643 -1.351227 -2.006386
H  -0.358597 2.830404 0.228502
H  2.765712 -3.265875 0.368749
H  2.431534 -3.510343 -1.354966
H  2.32376 2.423226 -2.408696
H  0.913321 3.364889 -1.850901
H  2.528107 4.124478 -1.934583
H  0.119099 -4.978001 -0.067429
H  -3.348851 -1.322275 0.432437
H  -2.280753 -5.537435 0.439942
H  -3.975089 -3.716254 0.701422
H  -4.183743 3.047839 -1.013717
H  -4.785307 2.239429 0.463774
H  -5.150118 4.753849 0.620989
H  -3.985508 4.2122 1.868786
H  -3.396363 5.026857 0.387271
