program: Gaussian 09
title: 000035080
version: EM64L-G09RevD.01
frameworkgroup: C1[X(C12H18N6)]
method: RPBEPBE
basis: SDD
operation: Freq
keyword: #pfreq=noraman
keyword: PBEPBE/SDD
title: #p freq=noraman PBEPBE/SDD
converged: YES YES NO NO
title: Mulliken charges:
elementType: N N N N N N C C C C C C C C C C C C H H H H H H H H H H H H H H H H H H
charge: -0.339658 -0.340762 -0.340058 -0.158428 -0.169236 -0.173019 0.078304 0.095928 0.110813 -0.435145 -0.432427 -0.431346 -0.034321 -0.036468 -0.036812 -0.580503 -0.578942 -0.578258 0.316081 0.317553 0.316258 0.262340 0.212756 0.257942 0.213503 0.258233 0.213816 0.236498 0.236737 0.236687 0.218170 0.215160 0.218541 0.215604 0.218786 0.215672
chargesum: 0.00000
title: Mulliken charges with hydrogens summed into heavy atoms:
elementType: N N N N N N C C C C C C C C C C C C
charge: -0.023577 -0.023208 -0.023799 -0.158428 -0.169236 -0.173019 0.078304 0.095928 0.110813 0.039951 0.039017 0.040703 0.202177 0.200270 0.199875 -0.147173 -0.144797 -0.143800
polarizability: 2.66114585e+02 1.69899948e+00 2.15174710e+02 6.51668030e+00 -7.76295378e+00 1.11268297e+02
1716.lowfreq: -6.3434 -3.8946 -0.0006 -0.0005 0.0005 5.5491 22.4766 27.3925 31.2577
frequency: 22.4631 27.3717 31.2168 40.4234 52.2700 66.1893 84.7947 91.8075 106.7486 147.8747 164.9935 177.3874 188.0768 191.9957 234.4030 275.1140 332.6503 336.5190 343.0962 362.3849 397.8766 474.8623 494.1386 529.0331 578.5055 588.7733 599.2465 606.3090 621.3382 647.7735 656.6303 684.0588 699.8568 704.5900 708.6884 787.7548 890.6495 893.2665 896.8069 910.5890 939.9874 943.6230 948.3596 951.3391 953.2891 967.2294 991.3203 1006.3860 1009.6683 1011.9733 1049.0391 1095.0684 1117.3548 1121.7918 1144.5424 1151.1519 1154.5025 1235.0852 1243.1586 1246.2907 1265.0812 1279.8283 1280.2682 1280.4907 1300.5763 1325.5524 1329.3606 1341.3414 1380.6718 1415.8768 1426.5714 1426.8420 1427.9096 1459.8783 1464.3498 1466.4729 1478.1552 1517.8340 1521.5298 1540.0887 1599.5928 1656.0552 1656.5924 1657.0675 2977.9451 2978.6162 2980.4234 3051.4257 3051.8641 3052.4840 3085.3804 3085.5757 3085.8484 3104.8064 3104.9365 3105.5976 3196.5982 3196.7760 3197.0352 3563.5564 3564.1972 3565.2907
redmass: 3.9683 3.7237 3.7459 4.1399 4.0374 3.4104 2.2042 2.2562 2.2478 3.1659 3.3941 6.8204 5.4438 5.3633 3.8635 4.4227 2.9119 2.5516 2.6032 3.1840 2.5502 1.8301 2.0112 2.8484 3.3889 1.2531 1.1268 1.1550 2.4042 2.0622 1.8285 2.5750 7.6278 6.4474 4.6186 12.0390 1.6943 5.3617 1.4593 1.7963 2.0179 2.1060 1.3581 1.6017 1.4905 1.8614 1.8875 1.1356 1.1894 1.3813 3.2661 3.9222 2.2424 2.6303 2.1267 2.5380 2.6514 1.6615 1.3082 1.3286 2.6505 1.2563 1.2432 1.2412 1.6602 1.2901 1.2975 1.3833 2.0169 1.6903 1.1986 1.1994 1.2566 1.4155 1.1009 1.0997 1.9274 2.7748 4.7458 3.4615 6.1086 4.5914 4.5902 4.5906 1.0634 1.0637 1.0629 1.0969 1.0977 1.0965 1.0602 1.0602 1.0602 1.0947 1.0948 1.0948 1.1141 1.1141 1.1141 1.0767 1.0767 1.0769
irintensity: 0.2978 0.0226 0.0435 0.0517 0.3372 2.4399 0.0774 0.6913 0.4433 0.0987 0.9083 4.9228 1.1665 0.0244 3.2116 0.1497 2.5390 1.4301 3.0127 8.4148 0.7715 5.5418 14.4890 9.8130 10.4478 9.6883 131.9967 182.2232 29.5688 24.7375 13.2433 18.1253 1.8228 5.1131 3.5984 41.8035 16.6259 0.5650 27.9404 1.0327 7.0193 26.7521 76.1610 50.7389 99.6359 9.0099 18.0229 2.8337 45.5098 10.2935 2.8673 5.3083 16.9516 16.5925 13.4461 13.5761 29.2427 57.1861 139.6863 17.1355 62.4217 0.4551 2.3573 1.3080 17.5481 61.3741 53.6758 11.4429 47.4847 274.6463 39.0236 12.1964 2.5377 42.8253 37.3959 68.2525 43.8693 170.4852 1352.1368 1658.7108 21.4326 31.8891 28.9979 6.0895 65.6317 81.7783 51.7587 9.1053 7.5650 5.9328 14.8560 13.9116 14.3659 8.8826 9.0488 10.6368 23.2534 24.7498 31.7821 74.1195 46.1519 40.8052
temp: 298.150 k
press: 1.00000 atm
elementType: 7 7 7 7 7 7 6 6 6 6 6 6 6 6 6 6 6 6 1 1 1 1 1 1 1 1 1 1 1 1 1 1 1 1 1 1
symmnumber: 1
zpe: 773840.5 jmol-1
zpe.correction: 0.294740 hartree
zpe.thermalcorrener: 0.313997 hartree
zpe.thermalcorrenthalpy: 0.314941 hartree
zpe.thermalcorrgfe: 0.243576 hartree
zpe.sumelectzpe: -795.198293 hartree
zpe.sumelectthermal: -795.179037 hartree
zpe.sumelectthermalent: -795.178093 hartree
zpe.sumelectthermalfe: -795.249458 hartree
dipole: 0.1610 0.1799 0.0066
dipole: 0.2415
quadrupole: -98.1335 -98.0590 -104.5086
quadrupole: 0.1594 1.3265 -1.5681
quadrupole: 2.1003 2.1747 -4.2749 0.1594 1.3265 -1.5681
hfenergy: -795.4930334 hartree
pointgroup: C01 [X(C12H18N6)]
dipole: -0.0660701 0.0682496 -0.0027227 debye
polarizability: 265.7032735|-0.1178404|214.6488363|10.4999531|10.6312713|112.2054822 unknown
InChI: InChI=1S/C12H18N6/c1-4-7-13-10-16-11(14-8-5-2)18-12(17-10)15-9-6-3/h4-6,13-15H,1-3,7-9H2
charge 0 multiplicity 1
36 atoms
N  2.823081 -1.15781 0.380365
N  -1.644753 -2.141051 -0.509509
N  -0.374354 2.263407 0.611731
N  0.596124 -1.680113 -0.06962
N  1.255348 0.603002 0.501845
N  -1.08959 0.086292 0.045188
C  1.523306 -0.722093 0.269626
C  -0.69089 -1.211022 -0.167133
C  -0.071223 0.942496 0.376471
C  3.966162 -0.296765 0.71625
C  -3.079235 -1.856407 -0.65467
C  -1.721399 2.84391 0.517465
C  5.001661 -0.269991 -0.392578
C  -3.921189 -2.696538 0.287192
C  -1.78156 3.970496 -0.496855
C  6.311688 -0.58009 -0.226403
C  -4.936986 -3.504572 -0.106467
C  -2.20844 5.227966 -0.220565
H  2.975613 -2.14595 0.173152
H  -1.301907 -3.094258 -0.638635
H  0.419879 2.863146 0.840217
H  3.545797 0.711774 0.882262
H  4.435724 -0.631519 1.662372
H  -3.197944 -0.780847 -0.430659
H  -3.403567 -2.023379 -1.701213
H  -2.387829 2.013791 0.220914
H  -2.055662 3.210789 1.5084
H  4.624502 0.028557 -1.381802
H  -3.659464 -2.614978 1.352463
H  -1.450539 3.708566 -1.512585
H  7.025736 -0.529133 -1.055695
H  6.708785 -0.887743 0.749736
H  -5.528297 -4.079579 0.614565
H  -5.210671 -3.608155 -1.164537
H  -2.250599 6.004773 -0.991874
H  -2.536005 5.513827 0.787486
