program: Gaussian 09
title: 000005625
version: EM64L-G09RevD.01
frameworkgroup: C1[X(C22H28N6O3S)]
method: RPBEPBE
basis: SDD
operation: Freq
keyword: #p
keyword: freq=noraman
keyword: PBEPBE/SDD
title: #p freq=noraman PBEPBE/SDD
converged: YES YES NO NO
title: Mulliken charges:
elementType: S O O O N N N N N N C C C C C C C C C C C C C C C C C C C C C C H H H H H H H H H H H H H H H H H H H H H H H H H H H H
charge: 0.998073 -0.254747 -0.544407 -0.530514 -0.196531 -0.141168 -0.470661 -0.403682 -0.005372 -0.552139 -0.358726 -0.392158 -0.382620 -0.419394 0.015477 0.108242 0.263299 0.299488 -0.491703 0.328800 0.205298 -0.059840 -0.305029 -0.585726 -0.352928 -0.387131 0.343115 -0.186949 -0.317857 -0.676655 -0.707476 -0.754795 0.222732 0.237428 0.251097 0.207275 0.220187 0.259813 0.248010 0.227270 0.282660 0.322175 0.297055 0.208542 0.239755 0.245788 0.242232 0.237213 0.222728 0.292406 0.209979 0.213752 0.242631 0.222143 0.203333 0.231329 0.289356 0.294560 0.280808 0.264162
chargesum: 0.00000
title: Mulliken charges with hydrogens summed into heavy atoms:
elementType: S O O O N N N N N N C C C C C C C C C C C C C C C C C C C C C C
charge: 0.998073 -0.254747 -0.544407 -0.530514 -0.196531 -0.141168 -0.148486 -0.106627 -0.005372 -0.262783 0.101434 0.066213 0.097380 0.055886 0.015477 0.108242 0.263299 0.299488 -0.209044 0.328800 0.205298 0.148703 -0.065274 -0.339938 -0.110696 -0.149919 0.343115 0.035779 -0.025451 -0.010294 -0.050671 0.084736
polarizability: 5.11843003e+02 -4.99583163e+01 3.07415655e+02 2.85727483e+01 7.29680021e+00 2.78362418e+02
1716.lowfreq: -3.7463 -0.0019 -0.0016 -0.0014 2.6297 6.0587 12.4994 15.8278 17.4563
frequency: 12.3977 15.8034 17.4014 30.0827 32.4632 46.7188 58.5171 66.5401 70.5596 77.6178 81.2351 96.4238 122.5310 130.1105 146.1359 152.5105 162.4736 166.4252 184.2073 203.5663 213.6724 222.7610 232.1459 238.7208 253.8235 256.4454 268.7006 286.7120 303.0689 314.7749 328.6575 338.3330 346.4111 352.3086 373.9398 389.2698 401.4824 414.5529 416.8014 441.6297 444.2328 452.4165 460.7416 498.0469 523.6486 527.1355 539.5600 548.0652 571.7589 578.9419 593.3604 606.0286 621.7946 634.1055 641.1044 652.4112 679.3932 725.3343 727.5953 749.3170 757.1631 765.0330 789.8172 790.9059 811.1049 816.7916 821.2718 826.8135 828.7462 838.7889 844.1582 854.7657 881.2936 881.8869 897.5222 920.7172 923.1554 940.6466 942.3217 949.0065 952.7035 954.7458 955.9423 966.7073 968.0489 1012.2444 1018.9528 1042.9993 1049.4901 1063.4861 1084.1122 1095.8014 1122.1461 1134.3958 1134.6013 1142.2383 1158.5054 1165.6522 1179.2443 1184.6875 1196.2682 1211.8085 1219.1887 1222.1562 1232.5107 1238.7675 1249.7297 1263.2057 1284.7469 1294.7168 1305.2124 1317.8894 1319.5822 1325.7410 1331.0979 1333.3433 1343.2663 1356.3979 1362.3842 1366.5862 1369.7224 1379.6031 1394.6938 1396.5306 1407.8203 1414.8547 1416.4237 1425.2517 1435.1860 1455.8515 1459.8905 1464.6505 1465.2258 1467.1976 1468.3302 1471.1486 1473.1056 1477.4402 1485.2509 1487.5588 1545.0954 1560.4927 1562.2396 1581.0218 1584.3685 1621.1695 2895.5177 2948.7477 2957.2614 2973.9667 2976.3683 2980.3181 2991.7466 3030.9937 3054.6407 3070.3201 3079.7950 3082.0693 3085.7743 3091.4868 3092.7284 3095.6013 3127.3459 3134.5727 3143.5866 3148.5661 3168.9514 3179.5135 3181.3472 3185.4591 3231.6699 3381.6539 3459.9989 3588.7145
redmass: 5.2790 5.3041 5.8987 5.7825 5.4543 5.4710 3.0841 4.0256 4.1694 4.8808 5.3361 4.2583 4.1107 7.8280 3.6336 1.2553 3.5752 3.9349 5.9692 6.2799 3.7573 1.0736 4.1688 2.8548 1.6237 3.7801 2.4399 3.9341 3.2753 3.4932 7.1241 3.6214 4.1136 3.5667 7.0492 2.6797 3.4048 2.1587 5.0581 3.2592 3.2428 3.0631 2.8271 3.6614 4.5082 5.5026 4.1537 8.1795 1.4766 3.1132 5.6197 3.6644 3.6302 2.9458 2.5484 1.7119 3.3096 4.5720 3.6741 3.4338 5.3913 2.7701 1.6848 1.8099 5.0151 3.0519 2.6196 1.9348 1.7093 1.6386 2.7564 3.4272 1.3833 1.7083 2.1710 1.3145 3.4096 2.9104 1.4301 2.0033 1.5313 1.3576 1.3520 2.1825 3.4445 2.3650 2.7248 2.2580 1.8419 2.0143 2.1607 2.0300 1.5462 1.7457 1.9890 3.8374 1.7016 1.9991 1.9022 2.6439 1.1733 2.3252 2.0746 1.2411 1.6565 1.7917 1.7910 1.4899 1.1379 1.7054 3.0475 1.8607 1.5503 1.9945 1.2969 1.4790 1.4015 2.5807 1.4021 1.7963 2.8297 1.2137 2.0460 1.5449 1.0573 1.9497 1.0580 2.6499 2.0788 2.4421 1.1472 1.2094 1.0738 1.0982 1.0747 1.6536 1.1583 4.3389 1.1736 1.1941 6.2197 4.5167 9.7991 5.5123 6.4183 7.4647 1.0708 1.0703 1.0698 1.0673 1.0382 1.0372 1.0819 1.0239 1.0909 1.0984 1.0990 1.0938 1.0999 1.0908 1.0942 1.1000 1.0920 1.0861 1.0905 1.0916 1.1000 1.0958 1.1073 1.1079 1.0984 1.0756 1.0751 1.0806
irintensity: 0.3029 0.2727 1.5457 4.4395 5.0597 2.0621 0.7577 0.8052 1.6820 1.8149 5.8072 1.3117 1.1857 7.4663 4.4257 3.1904 4.2698 3.3073 6.5889 1.3705 1.6466 0.1123 4.8950 6.6744 0.7958 2.9326 2.6208 5.6717 14.5061 7.3164 12.2828 1.1912 27.7855 5.3830 31.4368 24.0804 30.8454 0.6390 5.9759 9.4136 2.9349 5.5189 0.7866 5.1594 3.8608 5.6386 10.6698 44.9743 105.1885 11.9924 15.7089 27.0485 9.1629 5.3757 31.4466 78.4026 3.4300 17.4927 4.0717 2.9796 13.3183 21.1398 62.4587 49.9206 27.3242 83.4011 12.8747 49.0194 34.0909 2.0821 5.5284 6.6207 0.7475 45.0186 18.8874 9.3794 35.4213 2.7432 1.2920 7.1862 5.7252 136.8925 3.7071 2.4703 43.9155 48.5706 83.8023 1.8117 2.4046 2.2087 1.2285 6.2814 16.7531 17.0476 5.5011 38.1004 15.8931 27.6127 62.9313 82.2551 4.0971 68.3995 194.2919 0.7825 89.8509 105.1364 62.7513 68.9539 4.8823 34.5918 31.0429 1.7549 25.6324 40.1732 4.9883 10.9319 11.5652 32.0352 17.2845 15.3557 116.4181 21.7889 232.8903 99.4338 6.6536 87.6631 11.5931 3.0887 9.7129 2.3194 16.4380 10.1904 25.4975 9.3761 11.1353 137.7369 14.4148 1.4250 43.5819 27.6165 131.8627 13.7420 234.9820 2.6352 126.2228 19.7959 80.8264 68.0141 28.7049 75.0479 21.4157 25.0188 17.8004 0.6036 10.1836 9.2277 64.1706 25.7979 23.9694 14.2177 5.5402 44.2193 9.1718 1.2199 6.4648 31.9166 32.7215 1.7078 0.1004 0.8632 0.8511 13.1746 27.5326 89.4021
temp: 298.150 k
press: 1.00000 atm
elementType: 16 8 8 8 7 7 7 7 7 7 6 6 6 6 6 6 6 6 6 6 6 6 6 6 6 6 6 6 6 6 6 6 1 1 1 1 1 1 1 1 1 1 1 1 1 1 1 1 1 1 1 1 1 1 1 1 1 1 1 1
symmnumber: 1
zpe: 1255450.8 jmol-1
zpe.correction: 0.478176 hartree
zpe.thermalcorrener: 0.509883 hartree
zpe.thermalcorrenthalpy: 0.510827 hartree
zpe.thermalcorrgfe: 0.411777 hartree
zpe.sumelectzpe: -1804.857525 hartree
zpe.sumelectthermal: -1804.825818 hartree
zpe.sumelectthermalent: -1804.824874 hartree
zpe.sumelectthermalfe: -1804.923924 hartree
dipole: 8.4847 4.4466 -3.8692
dipole: 10.3312
quadrupole: -252.6373 -208.7229 -195.2930
quadrupole: 27.1748 21.6458 -14.1620
quadrupole: -33.7529 10.1615 23.5915 27.1748 21.6458 -14.1620
hfenergy: -1805.335701 hartree
pointgroup: C01 [X(C22H28N6O3S1)]
dipole: -3.3155549 1.4509232 1.8501318 debye
polarizability: 512.5984562|44.9426888|309.3222791|33.1955184|-2.5034552|275.7003402 unknown
InChI: InChI=1S/C22H28N6O3S/c1-15(2)24-19-5-4-8-23-21(19)27-9-11-28(12-10-27)22(29)20-14-16-13-17(26-32(3,30)31)6-7-18(16)25-20/h4-8,13-15,24-26H,9-12H2,1-3H3
charge 0 multiplicity 1
60 atoms
S  7.68686 1.71538 -0.04806
O  0.177998 -3.935369 1.087783
O  9.243876 1.547737 0.385237
O  7.227298 2.69246 -1.25806
N  -3.465513 -0.668667 -0.10963
N  -1.013633 -1.989436 0.574349
N  1.588156 -1.114555 -0.678534
N  -4.569464 1.642305 0.987622
N  -5.093415 -0.639581 -1.879358
N  7.092446 -0.09286 -0.522367
C  -3.306864 -2.129917 -0.336576
C  -2.162966 0.045467 -0.25072
C  -2.30581 -2.707683 0.679681
C  -1.147176 -0.525305 0.754462
C  -4.574078 -0.045133 -0.779156
C  0.175445 -2.713795 0.732039
C  1.451501 -2.019973 0.398899
C  -5.112774 1.16638 -0.205744
C  2.704023 -2.205509 0.988453
C  3.651172 -1.388598 0.266553
C  2.922435 -0.722998 -0.788127
C  -5.141285 2.752551 1.779079
C  -6.177082 1.790038 -0.910439
C  5.039653 -1.140229 0.40553
C  3.554765 0.140287 -1.714145
C  -6.148154 -0.044416 -2.515175
C  5.684257 -0.300961 -0.53818
C  -6.689603 1.1820 -2.0798
C  4.937559 0.337276 -1.589232
C  -6.455237 2.35183 2.501056
C  -4.077798 3.245343 2.781378
C  6.683193 2.269662 1.505812
H  -2.962502 -2.339141 -1.37174
H  -4.291587 -2.610629 -0.216319
H  -2.315243 1.122653 -0.063235
H  -1.769391 -0.072976 -1.288543
H  -2.71022 -2.60529 1.707893
H  -2.118467 -3.777197 0.49295
H  -0.168295 -0.033747 0.643827
H  -1.512537 -0.325866 1.785391
H  2.896239 -2.863391 1.833322
H  0.84964 -0.90575 -1.34908
H  -4.022365 0.939197 1.498738
H  -5.360451 3.579625 1.07509
H  -6.622784 2.717654 -0.538754
H  5.614519 -1.613495 1.21122
H  2.995708 0.630248 -2.51825
H  -6.544855 -0.56999 -3.389865
H  -7.514205 1.646274 -2.630121
H  5.4822 0.969712 -2.296013
H  -6.251527 1.588158 3.274645
H  -6.912692 3.228408 2.995798
H  -7.190632 1.932036 1.792508
H  -4.467173 4.090304 3.375651
H  -3.802947 2.438502 3.488603
H  -3.164024 3.57686 2.257574
H  7.61482 -0.692992 0.142944
H  6.956584 3.323635 1.653421
H  5.620976 2.143293 1.256538
H  7.011424 1.630074 2.336276
