program: Gaussian 09
title: 000035083
version: EM64L-G09RevD.01
frameworkgroup: C1[X(C9H9Cl3N6O3)]
method: RPBEPBE
basis: SDD
operation: Freq
keyword: #p
keyword: freq=noraman
keyword: PBEPBE/SDD
title: #p freq=noraman PBEPBE/SDD
converged: YES YES NO NO
title: Mulliken charges:
elementType: Cl Cl Cl O O O N N N N N N C C C C C C C C C H H H H H H H H H
charge: -0.060259 -0.067144 -0.062861 -0.153116 -0.150720 -0.172833 -0.376423 -0.376734 -0.376185 0.032471 -0.057893 -0.143229 0.119406 0.100542 0.084857 0.252489 0.254534 0.257990 -0.668145 -0.666557 -0.667126 0.367362 0.356303 0.357758 0.301872 0.302019 0.302813 0.303040 0.302853 0.302915
chargesum: 0.00000
title: Mulliken charges with hydrogens summed into heavy atoms:
elementType: Cl Cl Cl O O O N N N N N N C C C C C C C C C
charge: -0.060259 -0.067144 -0.062861 -0.153116 -0.150720 -0.172833 -0.009061 -0.020431 -0.018427 0.032471 -0.057893 -0.143229 0.119406 0.100542 0.084857 0.252489 0.254534 0.257990 -0.064254 -0.060704 -0.061357
polarizability: 2.53245483e+02 -7.45191511e-01 2.57569403e+02 1.41548449e-01 1.48902983e-01 7.97590588e+01
1716.lowfreq: -4.9642 -0.0027 -0.0025 -0.0022 0.9976 4.1359 10.1632 17.3957 22.3380
frequency: 10.0315 17.3816 22.3136 45.2072 47.2974 48.6742 53.7042 61.9347 64.1508 88.3420 100.7114 106.7712 125.8851 154.2951 203.1047 209.8397 212.8077 244.3261 265.0869 316.3547 363.1607 366.6536 376.2365 454.2600 472.0817 475.9528 487.6029 547.9837 551.3422 557.4366 675.7137 680.8901 688.1934 692.1500 699.7459 709.2759 712.1675 785.3134 797.6794 809.1705 816.6084 834.0661 885.0737 892.8501 904.1637 904.8743 905.4108 927.7559 958.4260 1054.5064 1057.7840 1156.1689 1156.4601 1158.6257 1169.6698 1172.3470 1201.5867 1236.0627 1258.8558 1260.0486 1262.1165 1306.2739 1375.9432 1414.7076 1415.2459 1415.6211 1420.8216 1446.6347 1492.5977 1503.3577 1552.7557 1568.3892 1636.5955 1639.2579 1644.0524 3069.2720 3069.6937 3070.5222 3151.0339 3152.2334 3152.6289 3432.4589 3440.9220 3443.1703
redmass: 12.5853 17.7355 13.4895 7.7404 14.0526 12.2386 3.4825 3.2378 2.8216 5.1222 6.4595 16.6590 23.7414 15.2083 13.7262 7.3654 7.9307 10.7529 5.7341 12.4294 16.1073 13.1429 13.3448 8.9472 6.6215 7.4826 7.8169 3.0497 3.0396 3.0327 7.4762 7.0009 6.8511 6.6909 3.9976 4.8887 6.8920 1.7924 6.7277 1.3587 1.3852 2.1823 7.8032 12.9860 1.7680 1.7666 1.7663 7.2287 6.9134 7.7972 8.6007 1.1109 1.1092 1.1082 3.1799 3.2162 2.9842 8.3082 1.1921 1.1885 1.1982 3.7346 4.8077 1.1067 1.2461 1.0957 3.4489 5.8931 2.1018 2.8660 3.2018 2.7025 8.1182 9.1621 8.4947 1.0566 1.0565 1.0566 1.1090 1.1092 1.1091 1.0763 1.0762 1.0763
irintensity: 0.0055 0.0132 0.0083 0.5505 0.2646 0.7718 2.2150 2.7461 37.6855 0.4038 0.0197 0.5020 2.0557 5.2798 14.1376 0.0629 0.1925 3.8205 2.2069 13.6788 1.0007 0.1270 6.1566 26.8070 22.9344 57.0037 37.5683 0.0109 0.0145 1.2504 46.5183 2.0295 176.1809 20.1159 0.3038 0.2196 36.8995 73.6734 7.3181 0.0459 4.7946 164.5353 2.3953 5.7169 4.7083 0.0019 62.1074 0.1795 1.1011 11.6880 7.3469 0.5840 0.6173 0.4979 173.1762 75.2225 19.9914 40.6238 20.3637 13.7745 19.4564 1.5734 277.2103 116.9872 381.3770 6.5806 853.5215 1668.8440 570.7510 1123.2092 162.3207 31.5569 52.3038 163.6020 177.0390 1.9356 1.7726 1.8418 0.3224 0.2611 0.2553 155.0026 56.1876 199.2067
temp: 298.150 k
press: 1.00000 atm
elementType: 17 17 17 8 8 8 7 7 7 7 7 7 6 6 6 6 6 6 6 6 6 1 1 1 1 1 1 1 1 1
symmnumber: 1
zpe: 516122.1 jmol-1
zpe.correction: 0.196581 hartree
zpe.thermalcorrener: 0.218063 hartree
zpe.thermalcorrenthalpy: 0.219007 hartree
zpe.thermalcorrgfe: 0.138713 hartree
zpe.sumelectzpe: -2281.215753 hartree
zpe.sumelectthermal: -2281.194270 hartree
zpe.sumelectthermalent: -2281.193326 hartree
zpe.sumelectthermalfe: -2281.273620 hartree
dipole: 1.5427 1.6041 0.0088
dipole: 2.2256
quadrupole: -141.1350 -141.9470 -137.4451
quadrupole: 0.3076 -0.2407 0.0630
quadrupole: -0.9593 -1.7713 2.7306 0.3076 -0.2407 0.0630
hfenergy: -2281.4123332 hartree
pointgroup: C01 [X(C9H9Cl3N6O3)]
dipole: 0.5830412 0.6527778 0.0249211 debye
polarizability: 257.0225495|0.594822|251.5901412|-10.589075|16.3886019|81.961254 unknown
InChI: InChI=1S/C9H9Cl3N6O3/c10-1-4(19)13-7-16-8(14-5(20)2-11)18-9(17-7)15-6(21)3-12/h13-15H,1-3H2
charge 0 multiplicity 1
30 atoms
Cl 0.29892 -5.308532 -0.571531
Cl -2.663803 5.027618 0.570343
Cl 5.08507 3.087913 -0.046454
O  -2.707483 -2.590851 -0.158097
O  -3.768151 1.112836 0.316302
O  4.142307 -0.861164 -0.380287
N  -0.344162 -2.376715 -0.256711
N  -1.655304 2.199781 0.268554
N  2.823807 1.093828 -0.108775
N  -1.130685 -0.126359 0.011248
N  1.238362 -0.702109 -0.186678
N  0.573441 1.616445 0.076858
C  -0.103117 -1.007617 -0.136404
C  -0.722973 1.171319 0.112591
C  1.506861 0.622718 -0.075053
C  -1.555913 -3.076032 -0.263727
C  -3.049928 2.139621 0.357093
C  4.01538 0.381988 -0.251233
C  -1.451623 -4.601023 -0.421178
C  -3.769866 3.487076 0.526259
C  5.304998 1.216682 -0.250277
H  0.516082 -2.93467 -0.357801
H  -1.232487 3.136559 0.326003
H  2.902856 2.115676 -0.01343
H  -1.984292 -4.905006 -1.334205
H  -1.903722 -5.084349 0.457193
H  -4.324349 3.483256 1.476078
H  -4.462632 3.633354 -0.315219
H  5.828791 1.072984 -1.206645
H  5.944814 0.891373 0.58298
