program: Gaussian 09
title: 000035052
version: EM64L-G09RevD.01
frameworkgroup: C1[X(C8H13I2N5)]
method: RPBEPBE
basis: SDD
operation: Freq
keyword: #p
keyword: freq=noraman
keyword: PBEPBE/SDD
title: #p freq=noraman PBEPBE/SDD
converged: NO YES NO NO
title: Mulliken charges:
elementType: I I N N N N N C C C C C C C C H H H H H H H H H H H H H
charge: 0.122011 0.121905 -0.332268 -0.333906 -0.117347 -0.026438 -0.096737 -0.304846 -0.302452 0.055484 0.059599 0.264711 -0.716634 -0.717910 -1.014783 0.235709 0.236539 0.239958 0.241271 0.327649 0.325796 0.222679 0.221969 0.232716 0.221481 0.220585 0.233368 0.379890
chargesum: 0.00000
title: Mulliken charges with hydrogens summed into heavy atoms:
elementType: I I N N N N N C C C C C C C C
charge: 0.122011 0.121905 -0.004618 -0.008110 -0.117347 -0.026438 -0.096737 0.167402 0.178777 0.055484 0.059599 0.264711 -0.039270 -0.042476 -0.634892
polarizability: 2.02004994e+02 -1.80186466e+01 1.87037041e+02 1.06940729e-01 -7.66724866e-02 1.57613913e+02
1716.lowfreq: -6.6230 -4.6997 -0.0007 -0.0007 -0.0004 3.5950 8.8676 18.6568 25.6977
frequency: 8.0314 18.4336 25.6942 51.1879 63.3796 73.7274 77.7390 107.2014 130.5400 154.0735 178.1981 203.2884 213.2310 221.5211 262.3345 271.5005 296.7361 343.2141 369.8448 495.0845 508.8050 530.1386 547.2702 587.9258 602.0001 670.6072 715.4465 716.7525 719.2167 794.9527 796.3048 810.8628 885.1627 891.4150 922.2022 997.7956 1023.1882 1063.0732 1087.9579 1136.8088 1144.7664 1145.0453 1148.1178 1171.1240 1172.3654 1258.1875 1261.6655 1264.7770 1268.8709 1339.3127 1350.2925 1379.7734 1395.7808 1397.7989 1419.6550 1453.1845 1477.6247 1477.9438 1478.1519 1480.6226 1488.4180 1498.6382 1501.3286 1552.8305 1593.0574 2982.6041 2982.7419 2992.2382 2995.2728 3034.2231 3036.6399 3078.2848 3078.7762 3093.7142 3094.8728 3147.7888 3560.3415 3561.7554
redmass: 5.0284 3.1153 2.2840 8.4981 5.2728 2.3811 4.6112 10.0404 2.6041 8.0413 5.3161 10.4201 2.3135 5.0230 1.2428 1.5979 3.7092 3.8120 3.4881 6.0529 6.2477 1.1342 1.2159 5.3160 8.0014 7.1778 9.9997 4.9652 9.7368 1.1140 1.1129 10.8776 2.3138 10.3570 1.9253 2.9978 5.1223 2.6349 3.0055 1.0587 1.5189 1.5255 3.1258 2.8987 1.5222 2.3014 1.1044 1.0979 4.4817 1.4301 1.7014 3.0388 1.2463 1.2411 1.5871 6.2559 1.0566 1.1839 1.0574 1.0590 1.7090 1.0876 1.1647 5.4649 6.9923 1.0370 1.0369 1.0590 1.0593 1.1038 1.1036 1.1015 1.1015 1.0984 1.0983 1.0868 1.0770 1.0771
irintensity: 0.0001 0.0051 0.0001 1.6196 0.5620 4.4084 0.7096 0.3445 0.0783 0.6448 0.3686 2.0630 0.0193 0.6924 0.0224 1.2537 0.5933 2.9248 0.4565 19.6161 148.1842 0.3531 122.1203 2.6411 48.6031 7.2531 0.4861 1.7652 73.1657 3.0537 3.1573 4.5823 4.8101 5.5029 0.7583 5.8786 4.7847 1.2404 1.7237 50.7331 2.3293 1.9979 1.7435 17.5276 45.2965 6.1702 0.0280 0.0605 0.1039 111.3140 8.0656 237.7486 30.8289 20.9509 28.6621 25.2532 20.2713 89.6804 22.1813 82.5946 235.1086 57.2071 5.6999 1559.3849 158.1801 32.5131 33.5269 25.4905 21.0012 8.2722 5.3730 43.8513 56.4253 30.4963 28.0322 3.2462 45.0410 88.4087
temp: 298.150 k
press: 1.00000 atm
elementType: 53 53 7 7 7 7 7 6 6 6 6 6 6 6 6 1 1 1 1 1 1 1 1 1 1 1 1 1
symmnumber: 1
zpe: 564227.3 jmol-1
zpe.correction: 0.214903 hartree
zpe.thermalcorrener: 0.232372 hartree
zpe.thermalcorrenthalpy: 0.233316 hartree
zpe.thermalcorrgfe: 0.162658 hartree
zpe.sumelectzpe: -608.296090 hartree
zpe.sumelectthermal: -608.278621 hartree
zpe.sumelectthermalent: -608.277677 hartree
zpe.sumelectthermalfe: -608.348335 hartree
dipole: 4.4839 1.2298 -0.0024
dipole: 4.6495
quadrupole: -103.0810 -99.0132 -119.7253
quadrupole: -4.4828 0.0310 -0.0943
quadrupole: 4.1922 8.2600 -12.4521 -4.4828 0.0310 -0.0943
hfenergy: -608.5109928 hartree
pointgroup: C01 [X(C8H13I2N5)]
dipole: -0.6617544 1.7053624 0.0003723 debye
polarizability: 209.5843645|-12.4011205|179.4579084|0.0050644|-0.037186|157.6136746 unknown
InChI: InChI=1S/C8H13I2N5/c1-3-11-7-13-6(5(9)10)14-8(15-7)12-4-2/h5,11-12H,3-4H2,1-2H3
charge 0 multiplicity 1
28 atoms
I  1.283238 -3.353198 1.842885
I  1.292321 -3.349571 -1.84083
N  -2.67508 1.070331 -0.002517
N  1.933378 1.87651 0.005694
N  -0.380449 1.527956 0.001473
N  1.187989 -0.353734 0.003155
N  -1.208974 -0.774049 -0.001871
C  -3.868809 0.206093 -0.005953
C  3.349318 1.467757 0.009649
C  -1.391823 0.602927 -0.001035
C  0.889195 0.997365 0.003333
C  0.097077 -1.161039 0.000122
C  -5.144537 1.064762 0.010796
C  4.258159 2.708574 -0.009548
C  0.279147 -2.661539 -0.000744
H  -3.848934 -0.446013 -0.899745
H  -3.838096 -0.465504 0.872624
H  3.550474 0.847519 0.903594
H  3.546462 0.822391 -0.866859
H  -2.781315 2.086353 -0.003938
H  1.687073 2.867799 0.007866
H  -5.190924 1.698395 0.915976
H  -5.201165 1.718669 -0.879349
H  -6.036005 0.414314 0.008252
H  4.086279 3.31829 -0.916117
H  4.088989 3.344739 0.879296
H  5.317304 2.399019 -0.006292
H  -0.699994 -3.155617 -0.003717
