program: Gaussian 09
title: 000035050
version: EM64L-G09RevD.01
frameworkgroup: C1[X(C8H14IN5)]
method: RPBEPBE
basis: SDD
operation: Freq
keyword: #p
keyword: freq=noraman
keyword: PBEPBE/SDD
title: #p freq=noraman PBEPBE/SDD
converged: YES YES NO NO
title: Mulliken charges:
elementType: I N N N N N C C C C C C C C H H H H H H H H H H H H H H
charge: 0.026093 -0.334711 -0.334625 -0.120976 -0.080020 -0.080122 -0.303563 -0.303348 0.052660 0.052510 0.168565 -0.718114 -0.718169 -0.860824 0.231660 0.240056 0.232845 0.238783 0.324632 0.324649 0.222824 0.220124 0.231711 0.221090 0.221822 0.231730 0.306342 0.306376
chargesum: 0.00000
title: Mulliken charges with hydrogens summed into heavy atoms:
elementType: I N N N N N C C C C C C C C
charge: 0.026093 -0.010079 -0.009976 -0.120976 -0.080020 -0.080122 0.168153 0.168280 0.052660 0.052510 0.168565 -0.043456 -0.043527 -0.248106
polarizability: 1.71800694e+02 2.08932638e-01 1.90471602e+02 -4.51112111e+00 2.08824936e-01 9.98475735e+01
1716.lowfreq: -3.9422 -0.0005 -0.0002 0.0003 3.6400 5.2408 8.1323 18.4627 27.4420
frequency: 7.2072 18.3424 27.4086 58.2968 70.3606 94.5941 126.3810 142.0121 179.1443 193.4589 210.7151 259.2499 268.3247 284.2949 296.0712 363.8356 365.4048 468.6083 522.9314 523.6281 540.2297 578.7111 657.2330 694.5485 716.6037 718.6591 794.4904 794.6313 810.4431 828.7507 893.1893 899.8121 921.8385 1001.9104 1020.9117 1062.3846 1088.8376 1119.6178 1144.6856 1144.8181 1149.8702 1171.7176 1198.9846 1260.1911 1260.5187 1262.3622 1264.5830 1336.6780 1351.8085 1384.9410 1396.8824 1397.8688 1416.9076 1428.4028 1446.2253 1477.6580 1477.8727 1479.0367 1480.6625 1489.6597 1498.5029 1501.4089 1550.0374 1590.3900 2984.3556 2984.5123 2993.9003 2994.4629 3035.5996 3035.6746 3079.8804 3080.0244 3086.6687 3095.5153 3095.6508 3187.6371 3563.1656 3564.2715
redmass: 2.3813 2.5180 3.9935 6.6077 2.4426 3.8100 2.6006 3.2258 5.5038 9.8880 2.3559 1.2502 1.6237 2.4462 3.6472 3.3803 3.3863 5.7214 1.7145 1.9378 1.1871 7.1089 6.1397 5.0206 10.2015 6.9201 1.1158 1.1095 9.9654 1.8553 11.3907 1.7835 1.9228 2.4808 5.2540 2.5063 3.0099 1.4069 1.5229 1.5222 3.1972 2.9173 1.1662 1.1229 1.1338 2.0029 4.7784 1.4240 1.5910 2.0618 1.2484 1.2405 1.6405 1.4821 5.7327 1.0466 1.0511 1.1732 1.0545 1.8496 1.0888 1.1806 5.2710 6.8849 1.0372 1.0371 1.0593 1.0590 1.1037 1.1035 1.1014 1.1014 1.0555 1.0983 1.0983 1.1122 1.0770 1.0772
irintensity: 0.0319 0.0359 0.0691 3.0117 4.1905 1.0984 0.0270 0.0470 0.0017 3.9012 0.0085 0.0036 1.4895 2.4732 0.4583 10.2792 0.4569 21.9302 5.0542 4.3557 172.4237 39.0363 8.7058 5.9850 0.0487 10.0989 7.5669 1.7806 15.7888 0.3679 7.3902 6.6863 1.1023 2.7797 1.0821 2.6049 1.1472 28.8466 3.1252 0.7403 0.6165 24.5095 16.8478 0.5813 0.9850 11.0834 1.2459 120.8484 0.6493 103.5096 39.8856 17.0339 28.7007 90.8879 6.6862 18.5240 11.7816 73.0162 87.3914 231.7031 65.7200 6.1700 1585.5231 118.1131 33.8902 32.5128 26.2869 25.9219 14.7683 1.6405 29.0234 75.9510 6.5889 34.7593 27.8019 0.1545 37.0264 84.1568
temp: 298.150 k
press: 1.00000 atm
elementType: 53 7 7 7 7 7 6 6 6 6 6 6 6 6 1 1 1 1 1 1 1 1 1 1 1 1 1 1
symmnumber: 1
zpe: 591954.5 jmol-1
zpe.correction: 0.225464 hartree
zpe.thermalcorrener: 0.241266 hartree
zpe.thermalcorrenthalpy: 0.242211 hartree
zpe.thermalcorrgfe: 0.176514 hartree
zpe.sumelectzpe: -597.467425 hartree
zpe.sumelectthermal: -597.451622 hartree
zpe.sumelectthermalent: -597.450678 hartree
zpe.sumelectthermalfe: -597.516374 hartree
dipole: -3.9378 0.0317 0.1470
dipole: 3.9407
quadrupole: -93.4150 -78.8768 -96.8147
quadrupole: 0.1302 3.3971 -0.0037
quadrupole: -3.7129 10.8254 -7.1126 0.1302 3.3971 -0.0037
hfenergy: -597.6928887 hartree
pointgroup: C01 [X(C8H14I1N5)]
dipole: -0.0014147 1.5184112 -0.3132964 debye
polarizability: 190.4735713|0.1070841|168.3582178|0.1766048|-16.0021693|103.2880808 unknown
InChI: InChI=1S/C8H14IN5/c1-3-10-7-12-6(5-9)13-8(14-7)11-4-2/h10-11H,3-5H2,1-2H3
charge 0 multiplicity 1
28 atoms
I  0.003338 -4.036992 1.092454
N  -2.341791 1.266636 0.098078
N  2.333644 1.276117 0.107954
N  -0.004227 1.321556 0.124622
N  1.219512 -0.750267 -0.335747
N  -1.217223 -0.754788 -0.342576
C  -3.666321 0.633616 -0.031894
C  3.661458 0.647699 -0.011785
C  -1.158334 0.597169 -0.043348
C  1.153705 0.601604 -0.037618
C  0.002609 -1.354541 -0.4623
C  -4.77388 1.664443 0.240604
C  4.763804 1.694523 0.217395
C  0.006202 -2.820904 -0.779291
H  -3.7723 0.205456 -1.046641
H  -3.736954 -0.21505 0.673844
H  3.760805 0.187867 -1.012887
H  3.745065 -0.177338 0.720496
H  -2.272261 2.26041 0.322635
H  2.259184 2.269065 0.334603
H  -4.696904 2.075257 1.264224
H  -4.728633 2.503404 -0.478397
H  -5.7649 1.189472 0.141909
H  4.706932 2.507935 -0.529392
H  4.691791 2.139513 1.227107
H  5.757337 1.223053 0.127696
H  0.926135 -3.124965 -1.294022
H  -0.909793 -3.128349 -1.299022
