program: Gaussian 09
title: 000005582
version: EM64L-G09RevD.01
frameworkgroup: C1[X(C19H24N5O3)]
method: RPBEPBE
basis: SDD
operation: Freq
keyword: #p
keyword: freq=noraman
keyword: PBEPBE/SDD
title: #p freq=noraman PBEPBE/SDD
converged: YES YES NO NO
title: Mulliken charges:
elementType: O O O N N N N N C C C C C C C C C C C C C C C C C C C H H H H H H H H H H H H H H H H H H H H H H H H
charge: -0.303482 -0.289611 -0.310379 -0.439730 -0.444566 -0.029268 -0.641301 -0.607084 0.328467 0.232862 0.148675 -0.553025 0.066537 -0.390661 0.328369 -0.369025 -0.900442 0.574552 0.151287 -0.541056 -0.634170 0.322628 0.261651 0.020953 -0.527317 -0.520467 -0.524476 0.226012 0.248356 0.266539 0.286267 0.296504 0.233810 0.230891 0.337014 0.329533 0.260032 0.250660 0.395898 0.346151 0.381340 0.340407 0.219227 0.237136 0.262244 0.214233 0.235568 0.269000 0.234701 0.236232 0.252320
chargesum: 1.00000
title: Mulliken charges with hydrogens summed into heavy atoms:
elementType: O O O N N N N N C C C C C C C C C C C C C C C C C C C
charge: -0.303482 -0.289611 -0.310379 -0.143226 -0.115033 -0.029268 0.100748 0.114664 0.328467 0.232862 0.148675 -0.078656 0.066537 -0.124122 0.328369 -0.082759 -0.098727 0.574552 0.151287 -0.281024 -0.383509 0.322628 0.261651 0.020953 0.191290 0.198335 0.198777
polarizability: 8.45836339e+02 -1.47980641e+01 2.02453432e+02 -6.44050417e+00 1.45035378e+01 2.15912513e+02
1716.lowfreq: -0.0011 -0.0005 0.0006 1.9404 3.3762 9.4084 16.1474 21.0468 24.2495
frequency: 16.0925 21.0404 24.2200 53.3979 54.1784 63.0959 76.8151 85.3775 98.4895 111.6989 115.4256 136.2970 153.9204 157.4974 167.7097 174.6205 190.0336 214.2208 220.3466 239.8585 250.6848 262.2197 280.3709 285.9932 306.7086 312.6588 324.1333 334.5054 352.2488 371.8328 381.0074 392.6644 412.3362 421.9639 448.7170 460.8429 471.1843 498.0605 509.4211 514.3255 527.3984 560.7188 571.7617 583.9300 598.7487 601.4455 606.8629 612.4442 634.9360 645.5864 659.6336 672.0730 688.0673 715.2197 740.9959 749.1491 775.2038 791.7126 827.6988 848.1323 855.0975 868.5225 871.0510 909.0241 932.7542 944.6649 971.2484 992.2234 997.9938 1010.8632 1037.5700 1041.7299 1053.7986 1086.0883 1088.7156 1092.8431 1110.9314 1112.7974 1114.0535 1143.6587 1150.1073 1156.6612 1158.9389 1163.5520 1187.1539 1198.5183 1201.8974 1219.0071 1254.9245 1301.0395 1321.3527 1330.1701 1354.2217 1357.7078 1364.0637 1371.6460 1377.5203 1399.2286 1399.8958 1420.6816 1428.8685 1435.2751 1437.8808 1454.5338 1457.1381 1460.3788 1464.3167 1474.5015 1479.6525 1484.0686 1487.6159 1488.2678 1496.9716 1510.6138 1528.7686 1549.0586 1572.4056 1586.6357 1600.2876 1611.4962 1625.0078 1655.5111 1676.2612 2928.7542 2948.7721 2979.0053 2980.1030 2982.9646 2992.8322 3031.3627 3080.2617 3082.6817 3093.7814 3115.2745 3125.9033 3131.3865 3137.8750 3147.1512 3149.2181 3172.7381 3188.3641 3500.9716 3522.3058 3538.9312 3544.0635 3658.9110 3686.7946
redmass: 4.8669 4.6620 5.3401 3.0131 2.7041 3.2101 2.7434 4.0676 2.7785 2.4620 5.0747 1.9638 1.1949 3.3605 1.1089 3.0214 4.0851 3.3524 4.3496 3.9895 5.1545 2.9728 1.4956 3.1766 2.5732 1.5564 4.6743 2.2331 3.4855 4.8210 2.9453 1.9748 1.5711 3.9730 3.4557 2.1173 3.1146 3.9885 4.6201 3.7468 6.3153 3.8218 3.1289 1.5015 3.9508 3.8699 2.5244 1.2865 3.2562 2.5833 2.3485 5.8579 4.6949 4.3584 4.8738 3.5895 5.1598 5.4549 1.5696 2.0208 1.7109 6.1946 2.4993 5.5573 9.3138 2.1770 2.0259 1.5365 3.0914 2.7955 1.5370 4.7411 1.7962 1.7841 2.9778 2.9048 1.2432 1.2374 1.2390 1.9125 1.3826 1.5631 1.4750 2.7868 1.9412 1.8287 1.4536 1.5648 1.8482 2.4541 3.4369 2.8466 2.1000 2.9299 4.1614 5.7584 2.7799 2.5187 1.2659 1.2630 1.3188 2.1710 1.4100 1.1363 1.1837 1.0702 1.7261 1.0601 1.1621 1.1716 1.1353 1.3517 1.4188 2.9258 1.1623 3.9043 5.3524 3.7535 4.2571 6.6495 1.3038 1.4583 2.9609 1.0677 1.0445 1.0304 1.0315 1.0346 1.0921 1.0974 1.1053 1.1022 1.0973 1.0906 1.1033 1.1038 1.1054 1.0911 1.0920 1.0909 1.0962 1.0777 1.0475 1.0766 1.0469 1.1035 1.1050
irintensity: 1.0073 2.0698 1.0718 5.0043 2.6125 3.2457 3.9311 4.8206 2.4450 4.2737 5.0741 3.5827 0.1637 0.0407 1.0895 8.5431 13.2853 1.1660 13.8151 4.4577 3.1684 4.5685 45.6488 6.3114 5.9467 19.7206 5.0502 1.9547 2.1825 22.6363 3.9447 0.7574 5.5537 1.5731 9.8045 30.4727 34.7349 5.1630 0.5348 3.3036 0.9757 5.3016 35.2126 172.8938 30.9426 6.2992 8.3416 194.2998 9.5082 14.4324 118.8242 1.7803 27.1424 78.7042 7.9903 18.7643 5.4755 8.8414 2.9708 54.8506 32.7862 11.3542 11.5024 35.0070 126.1066 11.5515 5.4585 21.9515 29.3581 119.5671 2.4584 141.7023 7.1637 9.1728 40.5782 29.9034 22.8257 40.5882 9.7100 15.0636 4.8772 36.4752 19.8263 20.5948 52.4387 173.1022 23.9285 57.9151 48.2778 308.9479 78.5176 60.2178 210.6429 2.2723 215.6599 19.7355 41.2929 18.2993 9.3791 38.7686 12.3934 371.9098 15.5130 43.7944 67.1391 14.8767 152.3951 15.2357 40.7389 95.3046 15.0369 89.7415 29.8193 249.5173 1.9534 48.6118 147.5304 862.6989 461.1375 151.5021 12.2858 405.0171 1469.1313 43.9861 15.0412 82.4007 97.3924 122.6404 14.2158 8.5969 22.4874 27.2202 37.7089 3.2714 32.1829 18.5409 9.6617 8.6611 1.7042 0.9336 0.1426 93.7203 168.4245 31.1863 426.9303 66.1156 66.2886
temp: 298.150 k
press: 1.00000 atm
elementType: 8 8 8 7 7 7 7 7 6 6 6 6 6 6 6 6 6 6 6 6 6 6 6 6 6 6 6 1 1 1 1 1 1 1 1 1 1 1 1 1 1 1 1 1 1 1 1 1 1 1 1
symmnumber: 1
zpe: 1082547.3 jmol-1
zpe.correction: 0.412320 hartree
zpe.thermalcorrener: 0.439800 hartree
zpe.thermalcorrenthalpy: 0.440744 hartree
zpe.thermalcorrgfe: 0.353246 hartree
zpe.sumelectzpe: -1235.619430 hartree
zpe.sumelectthermal: -1235.591950 hartree
zpe.sumelectthermalent: -1235.591006 hartree
zpe.sumelectthermalfe: -1235.678505 hartree
dipole: -20.1322 3.6106 5.9492
dipole: 21.3010
quadrupole: 33.4542 -149.4288 -129.5665
quadrupole: -21.1538 -25.9998 11.6421
quadrupole: 115.3012 -67.5818 -47.7195 -21.1538 -25.9998 11.6421
hfenergy: -1236.0317505 hartree
pointgroup: C01 [X(C19H24N5O3)]
dipole: -7.9565552 0.5119253 -2.5813456 debye
polarizability: 845.8411746|14.1109174|194.731066|8.1244463|-6.2538959|223.6300432 unknown
InChI: InChI=1S/C19H24N5O3/c1-10-11(5-6-13-16(10)18(20)24-19(21)23-13)9-22-12-7-14(25-2)17(27-4)15(8-12)26-3/h5-8,22,24H,9,20-21H2,1-4H3
charge 1 multiplicity 1
51 atoms
O  4.760875 -2.216318 -1.113009
O  4.545338 2.348378 0.83149
O  6.163749 0.19031 -0.301934
N  0.549155 -0.36635 0.388892
N  -6.108216 0.148926 -1.21743
N  -5.891118 -0.661807 1.014626
N  -4.421793 1.100227 -2.503201
N  -7.971167 -0.769054 -0.059562
C  -1.752504 0.281954 1.007847
C  -2.464109 0.518058 -0.193034
C  -3.890432 0.241167 -0.21355
C  -0.265972 0.593022 1.143633
C  -4.540954 -0.326655 0.964085
C  -2.419302 -0.252399 2.152494
C  -4.770315 0.504197 -1.328381
C  -3.779307 -0.565757 2.135095
C  -1.703587 1.034885 -1.40883
C  1.941873 -0.196969 0.209963
C  -6.642481 -0.440884 -0.051859
C  2.597867 1.010212 0.559465
C  2.688537 -1.249453 -0.387483
C  4.071765 -1.103063 -0.593808
C  3.991315 1.153355 0.354003
C  4.755408 0.085579 -0.195288
C  5.571224 -1.977383 -2.332674
C  5.540419 3.052796 -0.011375
C  6.895453 -0.635115 0.69622
H  -0.055951 1.612002 0.762801
H  0.000697 0.611462 2.223554
H  -1.836831 -0.424332 3.064264
H  -4.291698 -0.990968 3.001095
H  0.203357 -1.327651 0.36267
H  -1.860963 0.394207 -2.298802
H  -1.959199 2.088267 -1.649909
H  -0.620388 1.001195 -1.228465
H  -6.732016 0.345655 -2.006019
H  2.081022 1.851657 1.027623
H  2.21485 -2.185652 -0.701007
H  -3.465634 1.411989 -2.655786
H  -5.093971 1.256427 -3.254833
H  -8.345037 -1.183715 0.793353
H  -8.591765 -0.642341 -0.855603
H  4.908827 -1.702778 -3.175158
H  6.064193 -2.938433 -2.541292
H  6.317454 -1.182749 -2.164004
H  5.070395 3.369952 -0.961768
H  5.829323 3.936012 0.577464
H  6.410588 2.411046 -0.217969
H  6.645253 -0.301416 1.719706
H  7.963445 -0.46547 0.492142
H  6.64383 -1.703425 0.570249
