program: Gaussian 09
title: 000035081
version: EM64L-G09RevD.01
frameworkgroup: C1[X(C17H16Cl2N6)]
method: RPBEPBE
basis: SDD
operation: Freq
keyword: #p
keyword: freq=noraman
keyword: PBEPBE/SDD
title: #p freq=noraman PBEPBE/SDD
converged: YES YES NO NO
title: Mulliken charges:
elementType: Cl Cl N N N N N N C C C C C C C C C C C C C C C C C H H H H H H H H H H H H H H H H
charge: -0.064470 -0.063989 -0.425702 -0.422257 -0.335472 -0.159310 -0.152754 -0.163576 0.068535 0.074115 0.048223 0.468827 0.469162 -0.305019 -0.441970 -0.303962 -0.441370 -0.303602 -0.716388 -0.190049 -0.209604 -0.190145 -0.209328 -0.125487 -0.125354 0.233352 0.231627 0.330316 0.330515 0.328109 0.232985 0.300261 0.232649 0.302142 0.223540 0.222436 0.231661 0.254740 0.255758 0.254783 0.256073
chargesum: 0.00000
title: Mulliken charges with hydrogens summed into heavy atoms:
elementType: Cl Cl N N N N N N C C C C C C C C C C C C C C C C C
charge: -0.064470 -0.063989 -0.095386 -0.091741 -0.007363 -0.159310 -0.152754 -0.163576 0.068535 0.074115 0.048223 0.468827 0.469162 0.159961 -0.208985 -0.003702 -0.208721 -0.001461 -0.038752 0.064691 0.046154 0.064637 0.046746 -0.125487 -0.125354
polarizability: 4.22950327e+02 1.10902108e+01 3.18747665e+02 -3.39595777e+00 2.13698539e+01 1.10047268e+02
1716.lowfreq: -6.1540 -3.2426 -2.5464 0.0005 0.0013 0.0018 9.7121 22.3229 26.0065
frequency: 9.4091 22.3111 25.9668 28.1884 37.1838 67.4414 74.8732 89.4700 100.2995 119.3744 137.8246 176.2382 192.8805 206.5294 214.8628 220.2383 232.1268 257.4786 267.9089 306.2937 323.8625 333.1824 339.3901 360.1412 406.0509 410.0695 415.5582 442.2665 496.6514 501.3605 504.5171 523.3853 609.0708 617.6577 630.2159 644.3416 644.7777 650.2971 666.5799 698.9851 701.6006 710.1778 714.8624 718.6691 748.4102 789.3230 796.3006 811.5747 814.2295 827.2817 830.6517 845.6227 851.0947 897.9281 917.0080 937.2120 938.0950 961.0142 982.2213 992.7961 998.6853 1026.6435 1048.3346 1072.2796 1073.9495 1086.1006 1112.6233 1114.3884 1145.5486 1165.4540 1179.6929 1184.5602 1228.3657 1244.7701 1250.3213 1260.4395 1290.7924 1294.8190 1302.6263 1346.2775 1350.2511 1376.4432 1393.0819 1398.1917 1404.5411 1413.7307 1431.1616 1464.5586 1475.4590 1478.3125 1480.6041 1484.3740 1494.8004 1499.2846 1536.0808 1546.9932 1583.9546 1593.3560 1605.2748 1607.6690 1614.4762 2984.6402 2988.5810 3030.0617 3079.7905 3095.3231 3125.5399 3125.7794 3161.7724 3162.2035 3171.7240 3172.4896 3200.0064 3200.9661 3525.1854 3527.3527 3566.9432
redmass: 2.4529 11.5259 4.0219 6.0881 4.7975 5.1643 4.3452 4.0553 5.2072 7.7227 5.5260 8.6630 5.7055 7.9440 4.7525 5.2233 6.9220 4.0067 1.6668 5.2749 5.1118 5.1212 4.7710 5.1697 7.8404 3.0036 3.0911 8.8581 5.1879 2.9382 2.8279 1.1292 6.8998 7.2874 6.3659 6.4901 1.7758 1.6175 5.7192 3.6458 3.7360 3.4355 4.1592 4.2248 6.4734 6.7409 1.1503 1.3523 1.4730 4.1625 1.5371 1.3657 4.7777 6.3158 2.4122 1.3551 1.3546 1.3356 1.6014 4.2132 2.5484 4.4008 4.2694 2.5871 2.6075 2.7509 1.3782 1.4046 1.5213 3.1530 1.1105 1.1132 3.4429 2.1570 3.2798 1.1026 1.6120 1.3856 1.7689 1.9652 2.9214 3.7155 5.7438 1.2695 4.1001 2.6960 2.5306 3.9663 2.3574 1.0402 1.1664 3.2598 2.5898 1.1034 2.6831 3.2201 7.2514 4.9317 4.9920 6.5136 5.7672 1.0381 1.0579 1.1037 1.1013 1.0984 1.0901 1.0901 1.0915 1.0915 1.0953 1.0953 1.0945 1.0942 1.0751 1.0751 1.0772
irintensity: 0.0605 0.0029 0.3123 0.0417 0.4223 0.3326 0.4377 2.0924 0.3472 1.5241 0.1178 1.5614 2.2889 1.9163 1.3140 0.5700 0.4902 1.9878 0.5476 2.6412 0.6428 0.1336 0.2015 1.0274 4.9582 0.2341 0.0058 46.6925 20.5221 66.8858 0.0648 90.9775 9.4164 1.3365 6.4100 5.1408 5.5253 108.3356 10.5336 1.3614 3.9020 1.7820 3.5766 21.0989 7.7735 36.0658 1.0702 60.1402 2.4991 8.4533 138.8414 1.3277 19.9958 1.1524 0.8556 2.1647 0.1227 2.2274 14.1224 11.7983 32.6383 0.6108 1.2273 21.6371 66.9543 5.8976 3.7932 4.4952 2.0481 24.3254 0.2365 16.6418 11.8373 42.3823 22.1004 0.3058 8.7965 1.0521 13.9244 81.3748 3.5153 25.6644 46.5086 41.4713 58.0263 133.3371 530.2533 289.4617 557.9007 13.4576 129.6043 985.5536 716.3861 69.5584 6.5676 1749.0724 107.8694 21.3019 8.3581 0.6626 53.9157 37.7922 27.1775 12.0136 50.6385 31.2824 9.5522 14.6480 2.6633 1.9842 4.2535 3.9587 9.5006 4.6293 43.1273 34.6966 87.2380
temp: 298.150 k
press: 1.00000 atm
elementType: 17 17 7 7 7 7 7 7 6 6 6 6 6 6 6 6 6 6 6 6 6 6 6 6 6 1 1 1 1 1 1 1 1 1 1 1 1 1 1 1 1
symmnumber: 1
zpe: 810882.5 jmol-1
zpe.correction: 0.308849 hartree
zpe.thermalcorrener: 0.331802 hartree
zpe.thermalcorrenthalpy: 0.332746 hartree
zpe.thermalcorrgfe: 0.251912 hartree
zpe.sumelectzpe: -1904.314493 hartree
zpe.sumelectthermal: -1904.291541 hartree
zpe.sumelectthermalent: -1904.290596 hartree
zpe.sumelectthermalfe: -1904.371430 hartree
dipole: -7.2158 -1.0727 -0.0067
dipole: 7.2951
quadrupole: -147.5439 -149.0456 -164.4516
quadrupole: -1.0313 -1.4670 7.4085
quadrupole: 6.1364 4.6347 -10.7712 -1.0313 -1.4670 7.4085
hfenergy: -1904.6233422 hartree
pointgroup: C01 [X(C17H16Cl2N6)]
dipole: -2.8548783 0.2950546 0.0106857 debye
polarizability: 423.7423133|-6.344772|317.9697528|1.552644|21.5046203|110.033195 unknown
InChI: InChI=1S/C17H16Cl2N6/c1-2-20-15-23-16(21-13-7-3-11(18)4-8-13)25-17(24-15)22-14-9-5-12(19)6-10-14/h3-10,20-22H,2H2,1H3
charge 0 multiplicity 1
41 atoms
Cl 5.470033 3.645771 -0.254599
Cl 4.253881 -4.883119 0.207507
N  -0.476343 2.557911 0.167318
N  -1.151427 -2.16574 -0.1288
N  -4.75927 0.772625 0.037017
N  -0.68456 0.177115 0.014968
N  -2.953329 -0.730608 -0.065283
N  -2.607633 1.678702 0.12034
C  -1.263492 1.419805 0.092519
C  -1.584534 -0.852286 -0.052213
C  -3.408723 0.560692 0.030301
C  0.925179 2.740081 0.072144
C  0.143041 -2.735975 -0.053202
C  -5.760888 -0.302336 -0.056267
C  1.437508 4.017585 0.433898
C  1.821646 1.742173 -0.396514
C  0.263987 -4.112848 -0.392258
C  1.296107 -2.023639 0.373126
C  -7.179675 0.286789 0.003518
C  2.814387 4.298866 0.3343
C  3.201324 2.021185 -0.493807
C  1.507623 -4.769888 -0.312456
C  2.542834 -2.679614 0.451028
C  3.683556 3.291431 -0.12705
C  2.637319 -4.040849 0.106625
H  -5.602113 -1.023575 0.767834
H  -5.611696 -0.86435 -0.998117
H  -1.043067 3.400312 0.29754
H  -1.935635 -2.813805 -0.24299
H  -5.059358 1.746263 0.103858
H  0.75797 4.796949 0.799699
H  1.432189 0.766238 -0.687373
H  -0.617211 -4.675166 -0.724433
H  1.204906 -0.972195 0.646698
H  -7.351399 0.825247 0.953812
H  -7.36012 0.986633 -0.833384
H  -7.928269 -0.520845 -0.066088
H  3.201552 5.282273 0.615128
H  3.888678 1.253792 -0.862113
H  1.594174 -5.827743 -0.575732
H  3.42805 -2.13126 0.7866
