program: Gaussian 09
title: 000035028
version: EM64L-G09RevD.01
frameworkgroup: C1[X(C9H12N4O2)]
method: RPBEPBE
basis: SDD
operation: Freq
keyword: #p
keyword: freq=noraman
keyword: PBEPBE/SDD
title: #p freq=noraman PBEPBE/SDD
converged: YES YES NO NO
title: Mulliken charges:
elementType: O O N N N N C C C C C C C C C H H H H H H H H H H H H
charge: -0.211206 -0.211226 -0.162781 -0.067904 -0.067916 -0.581189 0.105868 0.105872 -0.326585 -0.326601 -0.008004 -0.053893 -0.053875 -0.552018 -0.552012 0.227937 0.231868 0.227921 0.231866 0.237255 0.237251 0.341589 0.341591 0.223529 0.219567 0.223529 0.219564
chargesum: 0.00000
title: Mulliken charges with hydrogens summed into heavy atoms:
elementType: O O N N N N C C C C C C C C C
charge: -0.211206 -0.211226 -0.162781 -0.067904 -0.067916 0.101991 0.105868 0.105872 0.133220 0.133186 -0.008004 0.183362 0.183376 -0.108921 -0.108919
polarizability: 1.67906710e+02 4.87387237e-03 1.77776881e+02 4.22921141e+00 1.32875446e-03 7.86309525e+01
1716.lowfreq: -7.8501 -6.6620 -0.0007 -0.0006 -0.0005 3.9779 39.0007 39.4601 51.3183
frequency: 38.9549 39.4563 51.2958 70.3337 82.1539 116.1582 119.3792 144.9015 191.4818 206.3461 224.8518 259.0153 277.2744 310.9968 340.9858 407.9780 466.4821 513.9377 522.3027 551.8036 556.3942 597.9995 630.5697 651.7579 699.2152 705.3587 706.4114 789.2997 873.9220 887.5623 896.0039 933.3741 935.2527 951.4243 959.5701 961.8983 972.0476 989.9364 1011.2527 1013.1107 1064.8790 1116.2562 1149.6260 1150.4468 1206.9735 1208.6959 1257.0171 1279.3177 1281.4932 1295.6856 1308.1484 1359.9601 1371.5255 1431.6556 1433.3332 1451.2933 1461.6534 1464.5740 1490.7533 1527.6239 1617.9768 1665.9883 1666.0577 2996.6081 2997.5747 3068.4886 3068.5497 3092.7571 3092.7681 3125.0659 3125.1024 3203.5854 3203.6205 3553.5466 3713.2159
redmass: 4.6578 3.1954 3.3883 2.5618 2.1983 3.3857 3.3311 3.1477 10.1262 8.1175 7.1913 2.7792 3.9131 2.9349 3.9369 2.4857 2.7885 1.2155 2.6281 5.5770 1.0461 2.0276 3.3670 2.5310 9.4158 12.2237 4.2843 12.4737 4.4949 3.0477 6.7573 1.6042 1.7870 2.0526 1.3685 1.4563 1.8167 1.9230 1.2416 1.3609 9.9779 3.0014 1.6680 1.6810 1.2432 1.2469 8.2333 1.3459 1.2591 1.6944 1.8590 2.9189 2.6375 1.2142 1.2741 2.2290 1.1393 1.5626 3.4912 3.2544 1.8879 4.8105 4.8143 1.0583 1.0584 1.1043 1.1045 1.0610 1.0610 1.0949 1.0949 1.1144 1.1143 1.0444 1.1060
irintensity: 0.0128 0.2913 0.0332 3.5049 0.0302 0.1456 13.0028 1.9293 3.6494 0.0100 0.1649 4.3755 1.2807 15.4432 3.7501 0.3170 4.1601 309.2465 4.9896 0.0214 0.0060 17.1826 4.3933 8.3303 0.1960 0.6118 0.8142 33.2477 43.3801 1.3325 11.0939 87.9652 23.7154 10.4952 48.3094 77.8087 45.0451 75.7587 19.0538 15.3439 99.2396 134.7458 0.0020 0.6008 0.1381 1.5367 101.8414 91.4233 25.3865 351.4895 297.0767 108.6018 163.7322 48.0616 51.0734 456.0856 15.5931 147.8031 277.7082 515.9178 469.6677 5.5899 2.6360 6.3737 27.8399 0.3419 29.7894 10.8939 8.4575 17.1396 0.0274 50.7854 0.1310 137.7120 55.7710
temp: 298.150 k
press: 1.00000 atm
elementType: 8 8 7 7 7 7 6 6 6 6 6 6 6 6 6 1 1 1 1 1 1 1 1 1 1 1 1
symmnumber: 1
zpe: 545259.5 jmol-1
zpe.correction: 0.207678 hartree
zpe.thermalcorrener: 0.223022 hartree
zpe.thermalcorrenthalpy: 0.223966 hartree
zpe.thermalcorrgfe: 0.163277 hartree
zpe.sumelectzpe: -718.440957 hartree
zpe.sumelectthermal: -718.425614 hartree
zpe.sumelectthermalent: -718.424670 hartree
zpe.sumelectthermalfe: -718.485359 hartree
dipole: 0.0003 -1.3758 -0.0002
dipole: 1.3758
quadrupole: -90.5977 -66.9277 -86.6178
quadrupole: 0.0003 -1.9495 0.0006
quadrupole: -9.2166 14.4533 -5.2367 0.0003 -1.9495 0.0006
hfenergy: -718.6486357 hartree
pointgroup: C01 [X(C9H12N4O2)]
dipole: -0.000714 0.541297 -0.0001404 debye
polarizability: 167.7978094|-0.0066831|177.7768755|-5.2532501|-0.0215611|78.7398589 unknown
InChI: InChI=1S/C9H12N4O2/c1-3-5-14-8-11-7(10)12-9(13-8)15-6-4-2/h3-4H,1-2,5-6,10H2
charge 0 multiplicity 1
27 atoms
O  -2.358148 -0.063975 -0.075922
O  2.357238 -0.058821 0.076342
N  -0.000571 0.035982 0.000072
N  1.22712 -2.061824 0.044096
N  -1.223713 -2.064528 -0.04292
N  0.003884 -4.056849 0.001047
C  -1.147309 -0.711603 -0.038028
C  1.147764 -0.709097 0.038485
C  -2.330441 1.433823 -0.088761
C  2.326267 1.438927 0.08856
C  0.002385 -2.690386 0.000765
C  -3.748523 1.885537 -0.300302
C  3.743271 1.893784 0.300596
C  -4.367551 2.810191 0.473551
C  4.360769 2.819199 -0.47357
H  -1.909243 1.799272 0.86452
H  -1.66286 1.755134 -0.910981
H  1.904775 1.803059 -0.865098
H  1.657581 1.759139 0.910306
H  -4.266612 1.437963 -1.158889
H  4.261837 1.447877 1.159761
H  -0.88383 -4.552055 -0.029254
H  0.89268 -4.550099 0.031559
H  -5.387374 3.146003 0.257697
H  -3.873303 3.258409 1.344543
H  5.379774 3.157301 -0.257428
H  3.866034 3.265741 -1.345147
