program: Gaussian 09
title: 000005668
version: EM64L-G09RevD.01
frameworkgroup: C1[X(C21H26N2O3)]
method: RPBEPBE
basis: SDD
operation: Freq
keyword: #p
keyword: freq=noraman
keyword: PBEPBE/SDD
title: #p freq=noraman PBEPBE/SDD
converged: NO YES NO NO
title: Mulliken charges:
elementType: O O O N N C C C C C C C C C C C C C C C C C C C C C H H H H H H H H H H H H H H H H H H H H H H H H H H
charge: -0.412173 -0.242475 -0.253793 -0.109828 -0.289360 0.462571 -0.168988 -0.597738 0.155774 -0.539308 0.053275 -0.441666 -0.432454 -0.380498 0.094872 -0.385636 -0.511863 0.247366 0.186125 -0.747501 0.184524 -0.368304 -0.449080 -0.260596 -0.253348 -0.496666 0.207648 0.245864 0.245351 0.190075 0.230552 0.260908 0.232948 0.225726 0.192772 0.219592 0.166818 0.188589 0.215886 0.205074 0.229351 0.237196 0.206491 0.217490 0.371215 0.253079 0.234972 0.218988 0.218881 0.240227 0.252832 0.248239
chargesum: 0.00000
title: Mulliken charges with hydrogens summed into heavy atoms:
elementType: O O O N N C C C C C C C C C C C C C C C C C C C C C
charge: -0.040958 -0.242475 -0.253793 -0.109828 -0.289360 0.462571 0.038660 -0.106523 0.155774 -0.118681 0.053275 0.052190 -0.013955 0.005912 0.094872 0.018840 -0.077438 0.247366 0.186125 -0.086323 0.184524 -0.115224 -0.214108 -0.041608 -0.034466 0.244632
polarizability: 2.97752484e+02 -1.36915700e+01 2.54511586e+02 -2.08225182e+01 -4.11629760e+00 1.84021059e+02
1716.lowfreq: -7.4669 -5.4000 -0.0009 -0.0007 -0.0006 0.3424 37.8766 39.2102 58.8539
frequency: 37.8719 39.1026 58.8228 68.8629 73.6646 85.7433 98.5035 138.7676 142.8958 163.3746 172.8616 174.5344 199.8666 208.5139 221.8977 250.9026 256.9107 277.0264 287.5618 308.7713 317.0253 327.2916 339.1372 341.9429 360.6702 372.6781 387.1958 411.6361 428.1087 442.1207 469.7523 501.2461 505.5834 526.2632 541.1788 560.7344 579.5121 584.2598 594.7986 643.1829 648.8478 703.2071 709.4658 740.2107 748.0845 755.8957 758.3814 779.0656 782.3068 800.1427 843.9418 856.6526 857.4128 866.0428 882.0356 892.6478 914.4951 933.1389 947.8836 948.4448 970.9228 976.3856 986.7423 1001.5278 1009.5334 1021.3207 1024.0522 1047.2417 1052.4293 1056.4653 1065.1323 1086.3797 1113.1643 1117.3673 1127.6411 1130.4960 1147.8729 1151.2700 1155.4266 1166.6347 1169.2255 1186.9076 1198.5781 1199.9897 1212.2355 1220.2058 1245.0316 1254.6995 1266.2562 1282.2022 1286.0049 1298.4552 1305.4022 1308.8151 1319.4337 1329.3389 1332.2539 1335.7594 1348.3544 1351.0356 1360.8168 1368.1053 1385.2317 1388.8118 1405.8499 1421.4375 1431.0545 1448.5277 1453.5019 1457.1234 1459.2979 1459.9402 1460.8393 1462.2656 1470.3280 1474.2536 1478.5008 1482.8956 1489.0117 1496.6073 1577.6121 1607.5704 1616.1393 1638.7710 2731.1803 2813.3005 2844.9621 2958.0408 2970.6709 2977.0025 2996.5106 3008.3708 3009.9175 3011.8266 3018.0261 3025.6354 3032.7589 3035.8279 3051.6319 3057.2204 3068.1767 3076.2802 3083.0307 3118.8013 3122.9038 3135.0958 3151.5878 3160.6453 3165.1451 3461.9596
redmass: 4.4722 3.9236 3.1749 1.9384 2.4526 2.0968 3.2191 3.1701 3.8358 4.6953 3.8101 1.8757 2.9622 3.4174 2.4260 1.9528 3.9674 4.9423 3.0450 2.9836 2.7586 2.6537 2.9832 3.0729 2.8385 2.5198 5.8543 3.0384 2.1192 2.0455 3.4773 4.5265 3.3258 3.1689 3.8766 4.1335 2.7298 3.8372 4.6975 5.9803 5.0395 4.1034 4.9545 3.6822 1.7038 3.5311 2.8370 1.3753 3.2244 2.3985 3.0029 1.5988 2.3444 2.1864 3.5855 2.2054 2.9551 1.3864 2.6921 3.3065 1.3047 3.1688 2.2559 2.2200 2.5632 2.1294 2.3687 1.9849 2.2637 2.2154 2.1563 3.2312 1.2679 2.0468 1.8152 2.4886 2.7857 1.5234 2.2745 1.9483 1.3518 1.9567 1.6552 2.0274 1.5255 1.6753 1.7394 1.4953 1.4837 1.7250 1.2845 1.6460 1.6781 1.5698 1.3837 1.4660 1.4797 1.4472 1.5059 1.4934 1.5729 1.9874 1.2506 1.4637 3.5600 1.2035 5.0603 1.0821 1.0502 1.1527 1.3556 1.5798 1.2240 1.0957 1.0951 1.9598 1.4835 1.0554 1.0525 1.0848 6.5234 9.0921 7.8568 8.8746 1.0770 1.0708 1.0708 1.0654 1.0599 1.0364 1.0622 1.0606 1.0612 1.0292 1.0993 1.0879 1.0897 1.0937 1.0992 1.1015 1.0986 1.1011 1.1001 1.1053 1.0850 1.0900 1.0949 1.1055 1.0991 1.0647
irintensity: 0.4696 0.4364 0.4208 0.6559 0.4386 0.1240 2.9422 0.7517 0.4392 3.9276 1.2529 0.6342 2.2627 3.7084 3.9833 0.8516 8.7877 1.9379 0.8014 31.3776 17.1445 11.3619 17.4661 5.9528 1.7370 0.2943 2.2600 6.7526 32.9365 53.1172 0.9015 0.4028 4.6162 0.8812 3.4628 7.2256 5.7042 0.2518 2.7632 8.9298 1.4318 19.9241 0.4853 9.9721 66.8240 11.5187 20.0735 8.2902 3.2329 3.8620 27.7871 1.2822 6.9405 0.9826 10.9179 1.6239 17.9045 2.3469 6.6001 15.9489 0.2722 31.1293 1.9365 5.7344 30.1461 10.7332 32.1515 8.2772 18.2299 0.8429 16.4321 67.9991 0.9525 11.0915 11.2802 42.8823 54.1196 1.0327 4.9683 45.2108 13.9489 94.1052 67.1716 65.6054 18.9685 6.9346 10.4608 6.1313 27.7605 43.1323 15.7637 26.7950 61.8952 5.4001 22.2078 2.4510 10.2697 5.0677 11.0913 33.9365 10.5595 27.4076 11.7794 12.5718 22.5905 17.9313 29.0165 1.6766 15.7103 23.8592 10.1289 12.3557 10.5599 1.6039 10.8815 24.2091 5.8943 4.0752 11.2244 13.5817 1.4000 139.1803 1.1747 9.6821 60.8164 83.0359 144.8783 35.9481 44.4753 40.6738 31.6804 23.0745 2.7515 25.5302 32.4960 35.9837 71.3807 58.8226 0.0647 55.8809 32.1104 16.9257 46.4861 18.2111 1.0337 14.7189 30.4336 9.3321 24.1296 37.5052
temp: 298.150 k
press: 1.00000 atm
elementType: 8 8 8 7 7 6 6 6 6 6 6 6 6 6 6 6 6 6 6 6 6 6 6 6 6 6 1 1 1 1 1 1 1 1 1 1 1 1 1 1 1 1 1 1 1 1 1 1 1 1 1 1
symmnumber: 1
zpe: 1137100.0 jmol-1
zpe.correction: 0.433099 hartree
zpe.thermalcorrener: 0.456399 hartree
zpe.thermalcorrenthalpy: 0.457343 hartree
zpe.thermalcorrgfe: 0.381914 hartree
zpe.sumelectzpe: -1149.080159 hartree
zpe.sumelectthermal: -1149.056858 hartree
zpe.sumelectthermalent: -1149.055914 hartree
zpe.sumelectthermalfe: -1149.131344 hartree
dipole: 1.3959 -1.5227 -3.8025
dipole: 4.3274
quadrupole: -146.6667 -144.8596 -151.9269
quadrupole: 3.7102 1.4951 6.3877
quadrupole: 1.1511 2.9581 -4.1092 3.7102 1.4951 6.3877
hfenergy: -1149.5132574 hartree
pointgroup: C01 [X(C21H26N2O3)]
dipole: 0.6363732 -0.4493944 -1.5138109 debye
polarizability: 300.9226611|-6.5212004|252.163613|-19.4628148|-3.6734994|183.1988546 unknown
InChI: InChI=1S/C21H26N2O3/c1-3-20-10-6-11-22-12-9-15-14-7-4-5-8-16(14)23(17(15)18(20)22)21(25,13-20)19(24)26-2/h4-5,7-8,18,25H,3,6,9-13H2,1-2H3
charge 0 multiplicity 1
52 atoms
O  -0.520395 -2.031981 1.655653
O  -0.925323 -2.49245 -1.947592
O  -2.125149 -3.280779 -0.119866
N  2.471329 1.703409 -0.451051
N  -0.678088 -0.254697 0.017584
C  2.166874 -0.707765 0.29273
C  1.66782 0.467649 -0.606384
C  1.220296 -1.894771 -0.056509
C  0.238844 0.76092 -0.310735
C  3.616758 -1.009488 -0.182721
C  -0.288632 -1.658525 0.265045
C  2.108635 -0.317942 1.8018
C  4.492843 0.268805 -0.129737
C  3.858086 1.44309 -0.912027
C  -0.357773 2.005358 -0.267008
C  1.831802 2.859059 -1.141563
C  0.470034 3.246887 -0.501457
C  -1.923482 0.365104 0.287099
C  -1.743259 1.789309 0.110634
C  2.671262 -1.372927 2.778268
C  -1.208196 -2.572522 -0.606374
C  -3.165529 -0.185694 0.668589
C  -2.845124 2.656268 0.321338
C  -4.243958 0.703289 0.871062
C  -4.087301 2.107909 0.700178
C  -1.824277 -3.258897 -2.853234
H  1.752598 0.098888 -1.671222
H  1.50605 -2.803472 0.500202
H  1.318527 -2.111281 -1.136417
H  3.582024 -1.380165 -1.229732
H  4.075487 -1.812746 0.422836
H  1.057762 -0.118441 2.077365
H  2.643314 0.640904 1.926516
H  4.643196 0.577152 0.9212
H  5.492507 0.055598 -0.554892
H  4.456105 2.362068 -0.767459
H  3.874277 1.200033 -2.009545
H  1.669923 2.631373 -2.227762
H  2.528059 3.716101 -1.083713
H  -0.045689 3.965955 -1.168665
H  0.651216 3.769807 0.458844
H  2.120647 -2.327549 2.702702
H  3.746506 -1.57284 2.612027
H  2.561157 -1.016828 3.81914
H  -1.403434 -2.492293 1.710047
H  -3.310563 -1.26165 0.802708
H  -2.730506 3.738933 0.195818
H  -5.219238 0.30165 1.168217
H  -4.945924 2.767662 0.868526
H  -1.409955 -3.095554 -3.856935
H  -2.850668 -2.864919 -2.774637
H  -1.814372 -4.326706 -2.57989
