program: Gaussian 09
title: 000005524
version: EM64L-G09RevD.01
frameworkgroup: C1[X(C13H17N3)]
method: RPBEPBE
basis: SDD
operation: Freq
keyword: #pfreq=noraman
keyword: PBEPBE/SDD
title: #p freq=noraman PBEPBE/SDD
converged: YES YES NO NO
title: Mulliken charges:
elementType: N N N C C C C C C C C C C C C C H H H H H H H H H H H H H H H H H
charge: -0.465164 -0.496150 -0.159297 -0.539873 -0.428508 0.064352 -0.411481 -0.539240 0.346687 0.289861 -0.438383 -0.370436 -0.256941 0.284123 -0.367219 -0.458509 0.201507 0.218404 0.207686 0.207692 0.204617 0.206816 0.222592 0.214892 0.228351 0.328706 0.310216 0.219992 0.221283 0.221102 0.223754 0.223642 0.284925
chargesum: 0.00000
title: Mulliken charges with hydrogens summed into heavy atoms:
elementType: N N N C C C C C C C C C C C C C
charge: -0.154948 -0.211225 -0.159297 -0.119961 -0.013130 0.064352 -0.000048 -0.101756 0.346687 0.289861 -0.210032 -0.041731 -0.036949 0.284123 0.075166 -0.011113
polarizability: 2.31168030e+02 -5.18353526e+00 1.69440033e+02 2.58645837e-01 -2.02184127e-01 8.94205745e+01
1716.lowfreq: -204.3555 -0.0006 -0.0002 0.0005 2.2830 6.2940 10.8852 43.9778 46.0888
frequency: -204.3554 43.9305 46.0829 78.7623 104.5578 108.4027 129.8388 215.7795 216.6768 248.8547 301.1031 309.0286 309.8821 399.9771 433.6840 450.4530 463.0271 496.6747 551.3512 578.3608 603.7459 646.6743 693.0293 719.5326 723.6022 766.9917 787.1159 796.1151 828.0466 840.6543 869.6943 884.6333 904.9775 911.2187 926.6362 942.9188 979.1184 998.2951 1012.8476 1040.6122 1073.8081 1084.0547 1084.7099 1095.7795 1106.3046 1135.7064 1164.1607 1173.5382 1183.4896 1190.1277 1208.3842 1217.4804 1227.2652 1252.6118 1271.0826 1274.8999 1299.1756 1311.3007 1326.3931 1335.7811 1347.1574 1356.1377 1379.7880 1421.2649 1450.3621 1458.4907 1462.4266 1470.5039 1471.9441 1477.0869 1478.5608 1507.5120 1552.9051 1600.8773 1610.6070 1631.2417 2916.6955 2955.7812 2956.4123 2967.0376 2979.3705 2983.6015 2996.5520 3009.4984 3022.8486 3038.6466 3046.9811 3047.3887 3114.3438 3141.3571 3162.6175 3572.6785 3606.9539
redmass: 1.2698 3.1803 4.6282 1.8732 2.9714 3.0863 2.8877 5.3491 3.4838 2.8413 2.6323 3.9663 2.3277 3.7696 3.8041 2.8613 1.2525 3.4359 3.4874 4.4912 2.7247 7.6251 5.1848 2.9983 6.1257 5.7907 2.0100 1.9362 1.1781 1.5840 3.0960 2.8430 2.3080 1.7739 1.4269 4.1738 2.8296 1.2913 3.0256 3.4556 2.5752 1.7599 1.7388 2.4892 1.7237 1.1572 1.3613 1.1210 1.6695 1.5950 1.0857 1.7440 1.6727 1.2884 1.5944 1.2129 1.7671 1.6032 1.5865 1.6128 1.4053 1.6280 3.1300 2.1598 1.5127 2.0752 1.1097 1.3288 1.4077 1.1357 1.1206 1.1329 2.4039 6.3882 5.1780 4.6894 1.0581 1.0662 1.0951 1.0567 1.0623 1.0657 1.0599 1.1085 1.0943 1.0988 1.1072 1.1044 1.0871 1.0940 1.0974 1.0751 1.0800
irintensity: 82.4883 1.1503 5.8571 2.2683 1.2247 3.0896 1.0662 0.9038 0.5954 0.9769 17.8168 4.7514 5.9685 1.9297 2.6079 3.3285 127.0005 2.2776 5.4194 3.6382 0.3440 4.5675 0.2629 3.6071 2.5951 3.2946 23.4469 31.5439 0.6618 13.8639 2.0003 4.5476 7.2569 7.5846 1.0611 10.2762 18.3115 6.0615 3.7638 15.8666 47.1412 4.0317 3.4085 11.2554 8.3835 1.9760 0.8591 1.3336 2.2257 2.1688 0.0736 12.1045 5.1214 5.8707 71.6007 0.8165 10.1541 45.6443 0.2877 2.1275 1.2702 3.9089 25.0285 55.1941 19.6751 22.1121 15.7750 62.4352 73.7185 9.9038 19.7064 4.5577 498.5529 348.6857 21.1445 197.7550 42.0053 33.6609 17.3666 83.3485 35.5482 56.7789 125.5994 17.0720 35.2826 72.1461 50.9510 81.7298 12.2675 25.1672 29.1384 32.2236 14.3797
temp: 298.150 k
press: 1.00000 atm
elementType: 7 7 7 6 6 6 6 6 6 6 6 6 6 6 6 6 1 1 1 1 1 1 1 1 1 1 1 1 1 1 1 1 1
symmnumber: 1
zpe: 733158.8 jmol-1
zpe.correction: 0.279245 hartree
zpe.thermalcorrener: 0.293065 hartree
zpe.thermalcorrenthalpy: 0.294009 hartree
zpe.thermalcorrgfe: 0.237837 hartree
zpe.sumelectzpe: -668.656705 hartree
zpe.sumelectthermal: -668.642886 hartree
zpe.sumelectthermalent: -668.641941 hartree
zpe.sumelectthermalfe: -668.698114 hartree
dipole: 0.4811 -4.4743 0.1033
dipole: 4.5013
quadrupole: -79.9555 -88.3629 -99.4332
quadrupole: -6.9814 0.4370 -0.0822
quadrupole: 9.2950 0.8876 -10.1826 -6.9814 0.4370 -0.0822
hfenergy: -668.9359505 hartree
pointgroup: C01 [X(C13H17N3)]
dipole: 0.2112586 -1.7542008 0.1200443 debye
polarizability: 231.2746895|-4.3257718|169.1416386|1.679003|-3.759712|89.6123087 unknown
InChI: InChI=1S/C13H17N3/c1-2-6-11-10(4-1)5-3-7-12(11)16-13-14-8-9-15-13/h3,5,7,14,16H,1-2,4,6,8-9H2
charge 0 multiplicity 1
33 atoms
N  1.08098 -0.600611 0.00381
N  3.320131 -1.435273 0.091662
N  3.031744 0.850616 -0.059651
C  -1.531933 -1.742651 -0.028151
C  -2.983133 -2.193712 -0.314119
C  -1.330815 -0.225885 -0.083815
C  -3.993023 -1.292975 0.424674
C  -3.874361 0.150031 -0.105987
C  -2.435541 0.665535 -0.119196
C  -0.002918 0.316747 -0.07544
C  -2.210205 2.064671 -0.171319
C  0.214137 1.715837 -0.137648
C  -0.89881 2.579681 -0.189188
C  2.447464 -0.332553 0.007221
C  4.71811 -0.96407 0.092153
C  4.507874 0.598176 -0.025997
H  -0.866123 -2.245956 -0.763516
H  -1.233004 -2.116957 0.97686
H  -3.18176 -2.133146 -1.40289
H  -3.105788 -3.253332 -0.019731
H  -3.78234 -1.315275 1.512859
H  -5.024342 -1.667646 0.282193
H  -4.50057 0.836673 0.49523
H  -4.283398 0.184149 -1.138037
H  -3.071066 2.744248 -0.194237
H  1.241822 2.087151 -0.137182
H  0.822191 -1.583519 0.07377
H  -0.734138 3.66238 -0.232373
H  5.288409 -1.372898 -0.764153
H  5.24425 -1.243277 1.025709
H  4.95486 1.131273 0.833022
H  4.972219 0.998622 -0.946023
H  3.051878 -2.414353 0.150989
