program: Gaussian 09
title: 000035025
version: EM64L-G09RevD.01
frameworkgroup: C1[X(C13H16N4O2)]
method: RPBEPBE
basis: SDD
operation: Freq
keyword: #p
keyword: freq=noraman
keyword: PBEPBE/SDD
title: #p freq=noraman PBEPBE/SDD
converged: YES YES NO NO
title: Mulliken charges:
elementType: O O N N N N C C C C C C C C C C C C C H H H H H H H H H H H H H H H H
charge: -0.201219 -0.202670 -0.413406 -0.165604 -0.154136 -0.005415 0.456166 0.075937 -0.445046 -0.333523 0.058448 0.028371 -0.198610 -0.218716 -0.227632 -0.229765 -0.256915 -0.679442 -0.676411 0.330699 0.223050 0.306881 0.223660 0.223958 0.223918 0.223878 0.227744 0.223727 0.229909 0.207007 0.234728 0.234824 0.206726 0.234419 0.234459
chargesum: 0.00000
title: Mulliken charges with hydrogens summed into heavy atoms:
elementType: O O N N N N C C C C C C C C C C C C C
charge: -0.201219 -0.202670 -0.082707 -0.165604 -0.154136 -0.005415 0.456166 0.075937 -0.221997 -0.026642 0.058448 0.028371 0.029135 0.005011 0.219986 0.218031 -0.027006 -0.002883 -0.000807
polarizability: 2.81904570e+02 1.48299086e+00 2.14824811e+02 7.72079339e-02 -2.04362375e-01 8.77189440e+01
1716.lowfreq: -6.0392 -5.7663 0.0005 0.0007 0.0008 0.4129 33.5363 39.1356 57.0410
frequency: 33.5017 39.1354 57.0397 64.2228 66.0325 85.5656 98.2057 120.1180 161.3091 178.1555 197.9855 212.9531 245.8195 256.1362 257.3796 274.1211 274.5040 300.6047 365.9310 383.3316 408.9519 508.7531 528.5155 583.8982 607.3800 620.1048 649.8361 661.0605 694.6516 700.4797 720.5931 728.4893 767.3457 790.0436 803.1427 803.2600 807.0059 842.2053 850.6677 875.6606 897.3516 916.3821 973.2406 984.7609 998.6566 1005.8163 1022.3469 1026.7401 1042.7071 1068.1516 1091.1679 1114.0140 1118.2341 1134.5812 1135.1672 1171.4806 1186.2765 1218.9525 1248.6387 1248.7978 1257.9928 1275.6407 1316.4190 1319.6991 1345.7770 1379.5738 1389.8335 1401.3113 1403.4559 1422.0895 1439.6126 1458.0871 1460.3364 1461.6061 1472.9393 1473.6058 1486.0222 1487.7481 1489.0274 1520.4790 1559.6733 1602.4780 1617.0370 2996.7074 2996.8465 3002.6174 3007.4807 3064.0234 3067.6977 3093.8178 3093.9076 3109.7522 3110.0762 3111.5666 3130.5635 3143.8136 3165.4947 3191.5369 3522.6002
redmass: 3.5992 3.5020 4.8678 4.3953 2.3763 1.8621 3.5246 2.4226 4.4236 7.1323 8.2933 2.1203 1.2867 1.9264 3.8478 4.4566 4.3421 4.4465 4.3013 4.7428 2.9337 2.8523 7.0527 7.4468 6.7686 6.7910 6.9670 1.8987 2.8889 4.0248 2.5164 6.7233 1.7428 7.9645 1.1940 3.4762 1.0956 1.2703 4.2614 4.5137 8.7352 1.4320 1.3518 6.1941 1.3048 2.3578 2.7044 2.3765 3.7322 5.2035 1.8720 2.2232 2.3655 1.4473 1.4410 1.0575 1.1114 3.6849 1.1383 1.1426 3.7506 5.0961 1.6353 1.7104 1.5859 3.0360 3.1705 1.2985 1.4551 2.7421 3.3650 3.1809 1.0399 1.0397 1.1266 1.0837 2.1213 1.1199 1.1934 4.0567 3.9306 4.3670 6.1753 1.0375 1.0362 1.0560 1.0576 1.1073 1.1069 1.0985 1.0984 1.1024 1.1022 1.0886 1.0869 1.0932 1.0998 1.0948 1.0751
irintensity: 0.0576 0.8943 4.1801 0.1704 0.0367 4.0504 2.3897 0.1347 1.4810 0.3063 0.1945 0.9447 0.1945 3.6376 1.6522 0.0009 0.0238 1.1280 15.5077 4.3267 0.0064 19.7633 7.2091 7.3614 14.0408 3.2467 13.0970 24.9468 21.3041 13.1482 15.0003 3.6950 79.0262 60.4124 3.4864 3.3080 3.9821 1.6611 5.3248 2.8447 0.2893 10.8593 0.0000 0.9335 1.8030 14.1846 2.4689 0.5635 34.4507 259.4160 97.0133 4.5287 9.7316 8.9401 1.2408 0.0044 5.8838 36.2282 0.0129 0.0035 40.7211 495.6773 278.0606 257.2332 28.8887 94.7277 140.5105 72.1591 8.9070 330.6844 474.1021 528.7131 11.7293 11.9549 57.3422 3.0859 16.4940 30.7289 1.7587 434.2939 586.6298 112.2382 42.4813 26.8696 24.7643 18.9433 18.3052 12.3844 10.6696 24.7243 27.3797 35.5517 42.8134 13.5227 1.2882 28.4866 25.9587 13.2312 33.4196
temp: 298.150 k
press: 1.00000 atm
elementType: 8 8 7 7 7 7 6 6 6 6 6 6 6 6 6 6 6 6 6 1 1 1 1 1 1 1 1 1 1 1 1 1 1 1 1
symmnumber: 1
zpe: 730179.7 jmol-1
zpe.correction: 0.278111 hartree
zpe.thermalcorrener: 0.296287 hartree
zpe.thermalcorrenthalpy: 0.297231 hartree
zpe.thermalcorrgfe: 0.230221 hartree
zpe.sumelectzpe: -873.044766 hartree
zpe.sumelectthermal: -873.026589 hartree
zpe.sumelectthermalent: -873.025645 hartree
zpe.sumelectthermalfe: -873.092656 hartree
dipole: -2.9226 -2.7738 0.0104
dipole: 4.0294
quadrupole: -108.6796 -93.9408 -114.6225
quadrupole: -15.7359 0.0445 -0.0130
quadrupole: -2.9319 11.8068 -8.8749 -15.7359 0.0445 -0.0130
hfenergy: -873.3228764 hartree
pointgroup: C01 [X(C13H16N4O2)]
dipole: -1.1694468 -1.069942 0.0277976 debye
polarizability: 281.9345953|0.2538083|214.7421127|-0.5835268|-2.5529865|87.7716168 unknown
InChI: InChI=1S/C13H16N4O2/c1-3-18-12-15-11(16-13(17-12)19-4-2)14-10-8-6-5-7-9-10/h5-9,14H,3-4H2,1-2H3
charge 0 multiplicity 1
35 atoms
O  1.031105 2.974589 -0.057067
O  3.832598 -0.670615 0.004389
N  -0.775222 -1.41189 0.040484
N  1.513494 -1.083943 0.024372
N  0.028727 0.844581 -0.008587
N  2.447455 1.164917 -0.026212
C  -2.184796 -1.238739 0.038165
C  0.261059 -0.502921 0.018897
C  -2.972643 -2.423644 0.065694
C  -2.827273 0.028088 0.010369
C  1.163812 1.610842 -0.029232
C  2.546574 -0.196781 0.00094
C  -4.37899 -2.344531 0.065757
C  -4.237478 0.089238 0.01097
C  -0.352696 3.537913 -0.059147
C  4.022543 -2.152167 0.032902
C  -5.023591 -1.085362 0.038619
C  -0.189167 5.053861 -0.079378
C  5.529978 -2.382095 0.02719
H  -0.434258 -2.377305 0.059428
H  -2.4812 -3.405172 0.086652
H  -2.215422 0.93087 -0.011399
H  -0.886545 3.157982 -0.949516
H  -0.880539 3.180947 0.844081
H  3.52219 -2.588593 -0.850481
H  3.53453 -2.552499 0.939975
H  -4.970572 -3.266416 0.086998
H  -4.725771 1.0703 -0.010564
H  -6.116839 -1.023178 0.039055
H  -1.183672 5.536527 -0.08322
H  0.365009 5.401121 0.809008
H  0.360472 5.377807 -0.979327
H  5.74256 -3.466704 0.048167
H  5.989451 -1.952944 -0.879326
H  6.001917 -1.915882 0.908644
