program: Gaussian 09
title: 000035026
version: EM64L-G09RevD.01
frameworkgroup: C1[X(C13H15ClN4O2)]
method: RPBEPBE
basis: SDD
operation: Freq
keyword: #p
keyword: freq=noraman
keyword: PBEPBE/SDD
title: #p freq=noraman PBEPBE/SDD
converged: NO YES NO NO
title: Mulliken charges:
elementType: Cl O O N N N N C C C C C C C C C C C C C H H H H H H H H H H H H H H H
charge: -0.068157 -0.200330 -0.201131 -0.403735 -0.155365 -0.161845 -0.002830 0.563669 0.084624 -0.361321 -0.305863 0.062484 0.026172 -0.221199 -0.230984 -0.228003 -0.229815 -0.244161 -0.678960 -0.676266 0.339150 0.316103 0.256099 0.229437 0.223321 0.223515 0.226557 0.226449 0.236470 0.207391 0.235527 0.235744 0.208488 0.234429 0.234339
chargesum: 0.00000
title: Mulliken charges with hydrogens summed into heavy atoms:
elementType: Cl O O N N N N C C C C C C C C C C C C C
charge: -0.068157 -0.200330 -0.201131 -0.064585 -0.155365 -0.161845 -0.002830 0.563669 0.084624 -0.361321 0.010240 0.062484 0.026172 0.034900 -0.001547 0.218832 0.223191 -0.007691 -0.000298 0.000990
polarizability: 2.81272673e+02 -1.61541433e+01 2.43103975e+02 -1.37058888e-01 -5.90211465e-02 9.00224311e+01
1716.lowfreq: -7.9207 -6.6172 -1.0179 0.0011 0.0017 0.0017 23.2696 37.7760 56.4063
frequency: 23.2178 37.7727 56.3971 58.8203 64.2213 85.7403 92.8583 120.0037 140.7452 143.9648 191.8692 197.9111 200.7577 214.0218 245.5139 252.1933 258.0264 293.0097 296.0427 350.5305 355.6847 396.9727 408.9800 441.7317 530.7477 537.8820 586.6233 616.0441 642.1045 675.9873 677.4138 698.4662 718.8669 733.6106 752.4877 760.6804 794.8259 803.3595 806.3342 807.4818 851.0681 872.9069 875.3985 898.5908 949.0440 996.9618 1005.6198 1006.0781 1023.2618 1034.5660 1049.2472 1071.1361 1114.3028 1116.3477 1127.9888 1133.0465 1134.6879 1170.1387 1221.4328 1247.9480 1248.2136 1252.8395 1275.1781 1302.7412 1319.0146 1339.0525 1375.4763 1385.9478 1400.9417 1403.0765 1424.0516 1437.4207 1445.4108 1459.9007 1461.1847 1468.7491 1473.4502 1474.1317 1487.2485 1488.2686 1518.7467 1554.7821 1582.6098 1617.9942 2998.4519 2998.9939 3004.9335 3013.8981 3067.3065 3074.9515 3095.8924 3096.0941 3111.9401 3112.4839 3141.0621 3159.3195 3177.6271 3188.0863 3478.2512
redmass: 6.2926 3.5483 4.7108 4.9581 2.4466 1.8781 3.6697 2.3851 6.4316 5.2714 6.7059 8.6704 6.5729 2.1113 1.2946 4.2586 1.9385 5.0818 3.7933 4.7725 5.1709 5.7684 8.6253 3.4392 7.0277 3.6053 7.4364 7.2488 7.2113 6.9810 3.5692 11.1806 4.3924 6.6827 1.4622 1.4566 5.1159 1.0976 4.6422 1.0961 4.4024 1.3427 4.5176 9.7200 1.3522 1.3065 2.3834 6.4819 2.5086 2.7737 3.1305 9.4142 2.2326 2.2135 1.6806 1.4476 1.4370 1.0660 2.4627 1.1400 1.1446 3.3456 4.7649 1.9280 1.8450 1.7761 3.5568 2.6879 1.2869 1.4186 2.9783 3.1483 2.7138 1.0398 1.0396 1.7407 1.0928 1.6958 1.1134 1.0838 4.4297 4.7374 4.2372 5.7320 1.0371 1.0360 1.0563 1.0578 1.1074 1.1068 1.0985 1.0985 1.1023 1.1027 1.0868 1.0916 1.0976 1.0958 1.0750
irintensity: 0.2881 0.9764 4.1312 0.4541 0.0008 4.1529 2.8324 0.1676 1.4232 0.1874 0.5022 0.1716 0.0274 1.1823 0.1758 1.7690 4.3433 1.2704 1.1120 1.6763 5.6013 0.3886 25.2133 8.5161 3.4351 2.7139 10.1595 8.9833 3.9703 38.7416 17.0844 0.0050 0.5485 4.8105 0.2614 101.7413 74.3565 3.4839 2.3117 4.7142 3.6360 2.4381 2.9713 0.4715 3.9148 2.0146 29.4028 24.7923 1.5282 8.7530 31.8288 369.0548 2.8500 7.4387 1.0629 6.7471 3.6152 0.4924 13.3336 0.0041 0.0225 0.9142 522.7635 95.0725 364.4415 113.8979 86.1064 165.1032 74.4908 6.5479 479.1007 334.9480 437.6327 11.9301 12.1183 95.9952 23.7909 167.2600 26.4442 0.5096 387.3018 490.5468 164.9982 157.9217 26.2252 24.8647 19.3621 15.7757 11.9522 7.6803 23.4013 26.9698 34.4076 44.6926 5.1507 10.3641 5.4366 24.1513 76.7180
temp: 298.150 k
press: 1.00000 atm
elementType: 17 8 8 7 7 7 7 6 6 6 6 6 6 6 6 6 6 6 6 6 1 1 1 1 1 1 1 1 1 1 1 1 1 1 1
symmnumber: 1
zpe: 705111.3 jmol-1
zpe.correction: 0.268563 hartree
zpe.thermalcorrener: 0.288020 hartree
zpe.thermalcorrenthalpy: 0.288965 hartree
zpe.thermalcorrgfe: 0.218637 hartree
zpe.sumelectzpe: -1332.435299 hartree
zpe.sumelectthermal: -1332.415841 hartree
zpe.sumelectthermalent: -1332.414897 hartree
zpe.sumelectthermalfe: -1332.485224 hartree
dipole: -3.4289 0.0799 0.0208
dipole: 3.4299
quadrupole: -126.5723 -104.8264 -126.0778
quadrupole: -16.9325 0.0251 0.0116
quadrupole: -7.4135 14.3324 -6.9190 -16.9325 0.0251 0.0116
hfenergy: -1332.7038613 hartree
pointgroup: C01 [X(C13H15Cl1N4O2)]
dipole: -1.3346794 0.1985136 0.0134793 debye
polarizability: 285.5596899|8.8631432|238.7121087|-2.1354166|3.3830316|90.1272802 unknown
InChI: InChI=1S/C13H15ClN4O2/c1-3-19-12-16-11(17-13(18-12)20-4-2)15-10-8-6-5-7-9(10)14/h5-8,15H,3-4H2,1-2H3
charge 0 multiplicity 1
35 atoms
Cl -2.483616 3.648309 0.164037
O  1.444969 -3.026973 -0.037717
O  3.88485 0.869369 0.020381
N  -0.770144 1.169322 0.090436
N  1.537873 1.058382 0.056137
N  0.245157 -1.00057 0.02568
N  2.68151 -1.090514 -0.008182
C  -2.143463 0.850571 0.097412
C  0.350094 0.361537 0.056822
C  -3.090697 1.913118 0.131034
C  -2.656786 -0.476829 0.072522
C  1.447747 -1.657316 -0.006836
C  2.651886 0.274596 0.024632
C  -4.475913 1.695482 0.139163
C  -4.04735 -0.705731 0.080518
C  0.121259 -3.722093 -0.042893
C  3.930613 2.365245 0.051695
C  -4.96432 0.368668 0.113361
C  0.430851 -5.213604 -0.100197
C  5.407868 2.740046 0.032256
H  -0.53903 2.16942 0.109003
H  -1.938842 -1.297955 0.050105
H  -5.160372 2.547866 0.165058
H  -4.415843 -1.736901 0.060414
H  -0.427376 -3.439699 0.874077
H  -0.454791 -3.375618 -0.920104
H  3.38158 2.751099 -0.825578
H  3.415023 2.712107 0.96487
H  -6.04333 0.18708 0.119488
H  -0.511447 -5.791184 -0.102909
H  0.996516 -5.462885 -1.013634
H  1.028828 -5.524465 0.772941
H  5.514055 3.839903 0.054998
H  5.931953 2.32016 0.907308
H  5.898088 2.360355 -0.879999
