program: Gaussian 09
title: 000005546
version: EM64L-G09RevD.01
frameworkgroup: C1[X(C12H11N7)]
method: RPBEPBE
basis: SDD
operation: Freq
keyword: #pfreq=noraman
keyword: PBEPBE/SDD
title: #p freq=noraman PBEPBE/SDD
converged: YES YES NO NO
title: Mulliken charges:
elementType: N N N N N N N C C C C C C C C C C C C H H H H H H H H H H H
charge: -0.038988 -0.003349 -0.046618 -0.096209 -0.636392 -0.616126 -0.581803 -0.024907 -0.117104 0.313431 -0.026414 0.056576 0.141651 -0.383307 -0.426409 -0.045422 -0.227763 -0.230927 -0.238234 0.253924 0.274733 0.228400 0.229525 0.231922 0.333084 0.342332 0.325986 0.348412 0.327201 0.332794
chargesum: 0.00000
title: Mulliken charges with hydrogens summed into heavy atoms:
elementType: N N N N N N N C C C C C C C C C C C C
charge: -0.038988 -0.003349 -0.046618 -0.096209 0.039024 0.058272 0.078193 -0.024907 -0.117104 0.313431 -0.026414 0.056576 0.141651 -0.129383 -0.151676 -0.045422 0.000637 -0.001402 -0.006312
polarizability: 3.59282314e+02 -6.06693359e+00 1.86697005e+02 6.86844227e-01 -8.75009719e+00 8.44654923e+01
1716.lowfreq: -6.1440 -0.0007 -0.0004 0.0005 2.3158 8.3509 37.5059 56.1489 77.6256
frequency: 37.5052 56.1265 77.6245 118.6093 122.3188 203.3298 208.7527 235.5345 250.7209 279.7517 293.1121 310.2136 382.7496 401.9432 424.1138 461.1832 469.0144 470.1546 472.8351 499.2286 527.0495 534.7574 555.6207 559.8741 581.1161 593.1401 614.8910 617.7863 660.6771 665.0236 670.9229 707.8749 717.9448 743.4628 761.7822 778.3364 805.7273 813.1246 861.1896 916.3577 932.5039 983.2265 984.2298 990.4886 999.1541 1022.4789 1039.3330 1055.2281 1083.0314 1132.3428 1173.2200 1178.9915 1190.8820 1229.1585 1290.1376 1310.1821 1323.7482 1355.1226 1376.0332 1407.4904 1412.6554 1430.9140 1455.2412 1471.7187 1487.3268 1506.1747 1535.1510 1555.8222 1581.4646 1594.7139 1607.2982 1611.0116 1618.9786 3122.9703 3130.5931 3143.1601 3154.7513 3167.1114 3524.9653 3529.3039 3557.8483 3686.1272 3688.1939 3719.7831
redmass: 5.2027 4.1481 5.1422 5.8593 5.7187 5.2295 5.8254 5.0284 6.0131 8.1323 3.5367 3.3035 3.8865 2.5756 4.8513 2.5644 4.1176 1.3093 1.3511 3.4797 3.1390 1.5770 1.0700 5.8006 1.4994 4.7516 2.6573 1.3894 7.2103 6.4780 7.8011 1.9453 7.3062 3.5150 6.9176 2.9741 7.0934 10.2092 1.2564 3.0054 1.4091 1.6291 3.8523 3.0393 1.3634 2.2933 1.8059 3.6198 1.6343 2.1870 1.0584 3.4233 1.1169 4.4456 6.0084 2.5124 2.0079 8.6649 6.8647 5.9114 6.1506 2.5018 4.2872 3.3753 2.6242 3.5476 3.4229 3.3473 5.7174 1.5676 1.8818 3.1717 2.1056 1.0853 1.0875 1.0929 1.0955 1.1011 1.0443 1.0446 1.0439 1.1049 1.1049 1.1060
irintensity: 0.0600 1.2619 1.1270 8.9024 0.7669 2.1586 6.3095 2.8046 1.0955 0.5013 9.1431 8.1187 0.3894 9.4083 0.4307 32.9840 1.1980 288.2640 76.7410 4.3117 28.8787 294.6716 0.4676 3.3889 82.2041 4.1894 3.7628 49.9605 1.5653 8.4915 11.4400 38.2643 3.6523 44.2409 0.8927 15.0665 2.5745 17.1912 1.2072 5.8109 1.5040 3.2424 16.2416 3.9270 0.6198 18.5838 3.8137 5.2076 6.9674 0.1219 0.0230 5.2161 1.3903 11.0395 4.1252 18.5870 0.0345 184.3687 8.9498 102.1408 11.9673 54.8110 85.3421 241.4842 95.7959 368.2645 68.2729 699.9604 2.7831 687.2383 261.0351 99.0341 170.0123 4.7464 1.2828 18.9637 26.9172 26.4629 85.3184 75.8926 200.5089 52.6456 64.1438 47.4115
temp: 298.150 k
press: 1.00000 atm
elementType: 7 7 7 7 7 7 7 6 6 6 6 6 6 6 6 6 6 6 6 1 1 1 1 1 1 1 1 1 1 1
symmnumber: 1
zpe: 597006.8 jmol-1
zpe.correction: 0.227388 hartree
zpe.thermalcorrener: 0.242667 hartree
zpe.thermalcorrenthalpy: 0.243611 hartree
zpe.thermalcorrgfe: 0.185131 hartree
zpe.sumelectzpe: -845.869957 hartree
zpe.sumelectthermal: -845.854678 hartree
zpe.sumelectthermalent: -845.853734 hartree
zpe.sumelectthermalfe: -845.912214 hartree
dipole: 2.3673 1.5279 -0.2818
dipole: 2.8316
quadrupole: -83.7904 -96.3884 -112.6766
quadrupole: -8.9227 -1.1708 -1.2691
quadrupole: 13.8281 1.2300 -15.0581 -8.9227 -1.1708 -1.2691
hfenergy: -846.097345 hartree
pointgroup: C01 [X(C12H11N7)]
dipole: 0.9397495 0.5306284 -0.2763472 debye
polarizability: 359.0473244|-6.1820224|171.7327765|6.6814745|-37.3882233|99.6647107 unknown
InChI: InChI=1S/C12H11N7/c13-9-7(6-4-2-1-3-5-6)16-8-10(14)18-12(15)19-11(8)17-9/h1-5H,13-15H2
charge 0 multiplicity 1
30 atoms
N  -0.018565 0.689288 -0.228651
N  -0.989612 -1.920577 0.401902
N  -3.222612 -1.125874 0.28662
N  -3.658623 1.234576 -0.336943
N  1.18104 -2.732752 0.446338
N  -1.874063 2.713346 -0.758108
N  -5.383518 -0.267985 0.111987
C  0.858331 -0.304037 0.039756
C  -1.359457 0.416474 -0.169591
C  2.309278 0.024203 0.012457
C  -1.873884 -0.886149 0.183601
C  0.337302 -1.649201 0.310903
C  -2.327594 1.466855 -0.426838
C  2.802669 0.928174 -0.968571
C  3.22183 -0.499054 0.972554
C  -4.028506 -0.056384 0.019818
C  4.167392 1.280696 -1.004724
C  4.58743 -0.140262 0.93785
C  5.068996 0.743653 -0.054917
H  2.098515 1.344615 -1.696169
H  2.855784 -1.141236 1.782077
H  4.530106 1.972141 -1.773628
H  5.271827 -0.541124 1.694015
H  6.129515 1.016963 -0.083386
H  0.744635 -3.644702 0.575405
H  2.181548 -2.655955 0.283568
H  -2.538539 3.464848 -0.924851
H  -0.865981 2.864028 -0.788626
H  -6.020752 0.500494 -0.076993
H  -5.716495 -1.19326 0.369544
