program: Gaussian 09
title: 000035006
version: EM64L-G09RevD.01
frameworkgroup: C1[X(C10H17ClN4O)]
method: RPBEPBE
basis: SDD
operation: Freq
keyword: #p
keyword: freq=noraman
keyword: PBEPBE/SDD
title: #p freq=noraman PBEPBE/SDD
converged: NO YES NO NO
title: Mulliken charges:
elementType: Cl O N N N N C C C C C C C C C C H H H H H H H H H H H H H H H H H
charge: 0.001747 -0.201260 -0.335803 -0.122627 -0.011139 0.053606 -0.354970 -0.441586 -0.348607 -0.333737 -0.355417 -0.693561 0.112809 0.091668 -0.305129 -0.501136 0.193510 0.193697 0.210489 0.213156 0.189370 0.189729 0.232380 0.233846 0.195863 0.195876 0.210795 0.210738 0.218561 0.340711 0.239489 0.238577 0.238354
chargesum: 0.00000
title: Mulliken charges with hydrogens summed into heavy atoms:
elementType: Cl O N N N N C C C C C C C C C C
charge: 0.001747 -0.201260 0.004908 -0.122627 -0.011139 0.053606 0.032237 -0.017940 0.030492 0.132489 0.036322 -0.053467 0.112809 0.091668 -0.305129 0.215284
polarizability: 2.14350378e+02 -8.47275022e+00 1.65911870e+02 -4.96515781e-01 -4.77675031e-02 9.11164726e+01
1716.lowfreq: -0.0002 0.0011 0.0019 4.4014 5.8714 6.6120 17.7505 35.6106 48.5464
frequency: 17.4680 35.5792 48.0034 62.1495 93.3111 96.1532 103.4460 128.3634 131.6887 139.7473 166.1335 182.6727 200.1459 221.0666 223.1499 230.5594 233.6992 298.1644 357.9526 406.8977 433.5751 494.8583 525.5683 567.4273 614.0538 646.4037 657.2598 702.2679 725.8425 742.1136 788.9890 793.3535 822.7814 882.7910 886.3224 890.3132 955.3932 990.6010 1006.4775 1024.2733 1046.9505 1068.1061 1081.4896 1105.6017 1112.0342 1126.9654 1156.4589 1157.9038 1181.4876 1200.9619 1240.2320 1245.7429 1249.6868 1280.9876 1292.5629 1293.5528 1299.0405 1326.1674 1341.1605 1356.4493 1365.2874 1381.7770 1389.6120 1434.8647 1451.0983 1456.2332 1463.0335 1465.2039 1467.2873 1473.7091 1476.4414 1480.4154 1488.4442 1494.5174 1502.3874 1581.0012 2956.5636 2960.2883 2966.7621 2972.3977 2974.5232 2984.8734 2993.1984 3005.0428 3005.5097 3018.4925 3034.3260 3050.3044 3070.8157 3074.7226 3109.0217 3150.7773 3555.5846
redmass: 3.8710 4.8410 1.6955 2.8828 3.0363 2.4740 3.7528 1.2716 1.9261 2.2759 6.0653 7.2672 3.7858 2.8874 1.5397 3.9538 4.4401 4.3260 7.4610 3.4857 4.0982 6.2731 5.7100 1.1693 5.7431 9.3091 7.7258 10.7729 1.0643 1.0970 5.0192 1.3437 10.0065 11.7361 1.2034 1.9071 8.7056 1.1474 4.8856 4.7690 2.9967 2.9333 2.1350 2.6126 1.2542 3.7186 1.6003 1.6175 3.9225 1.4639 1.9975 3.1659 1.2489 1.1035 1.0884 1.3821 1.1004 1.9217 2.1868 1.6275 1.6541 2.0163 1.2182 2.9659 1.0513 1.3747 1.2968 1.0732 1.1035 1.0813 1.0424 1.0815 1.0936 1.2085 2.6983 7.5717 1.0589 1.0591 1.0592 1.0592 1.0362 1.0586 1.0977 1.1002 1.0296 1.1032 1.1050 1.1052 1.1008 1.0993 1.1047 1.1048 1.0772
irintensity: 1.3008 0.6321 0.0552 0.0789 3.5324 2.4149 0.1385 0.2341 0.0269 0.1906 0.5946 2.1810 4.2520 0.5232 0.5680 1.6619 1.8292 5.2368 16.9895 3.4821 0.2808 3.8929 1.0923 84.7130 6.4226 8.2296 3.6548 0.2168 12.9661 0.0395 24.1101 0.6310 48.4639 2.4271 1.1940 7.2929 63.2185 0.3087 61.0115 41.7141 21.4305 1.6102 0.0485 6.5078 0.1332 64.2019 3.6420 20.4448 96.8425 0.1340 50.1324 69.9629 0.2577 0.0259 0.6081 12.4531 0.7950 80.4700 118.7392 31.2784 44.5078 284.0838 15.7630 309.7161 15.5103 39.7793 181.2293 2.6521 19.0792 1.3669 12.9298 0.1383 10.6946 148.8661 346.5405 768.8694 1.4235 0.3025 0.6276 103.9729 41.0615 49.2019 0.0717 0.0247 36.2741 1.2821 10.7945 109.1743 96.4325 50.9249 26.3763 21.8726 73.7352
temp: 298.150 k
press: 1.00000 atm
elementType: 17 8 7 7 7 7 6 6 6 6 6 6 6 6 6 6 1 1 1 1 1 1 1 1 1 1 1 1 1 1 1 1 1
symmnumber: 1
zpe: 705468.2 jmol-1
zpe.correction: 0.268699 hartree
zpe.thermalcorrener: 0.286727 hartree
zpe.thermalcorrenthalpy: 0.287671 hartree
zpe.thermalcorrgfe: 0.219786 hartree
zpe.sumelectzpe: -1144.304613 hartree
zpe.sumelectthermal: -1144.286585 hartree
zpe.sumelectthermalent: -1144.285641 hartree
zpe.sumelectthermalfe: -1144.353526 hartree
dipole: -7.3030 2.0078 0.0502
dipole: 7.5741
quadrupole: -126.9002 -97.8202 -102.3753
quadrupole: 4.8270 0.0648 -0.0623
quadrupole: -17.8683 11.2117 6.6566 4.8270 0.0648 -0.0623
hfenergy: -1144.5733115 hartree
pointgroup: C01 [X(C10H17Cl1N4O1)]
dipole: 2.8325127 -0.9255626 -0.0027966 debye
polarizability: 213.437476|-10.7324226|166.8246095|-0.3978425|0.3027352|91.1166351 unknown
InChI: InChI=1S/C10H17ClN4O/c1-3-4-5-6-7-12-9-13-8(11)14-10(15-9)16-2/h12H,3-7H2,1-2H3
charge 0 multiplicity 1
33 atoms
Cl -4.764546 2.524717 0.046229
O  -3.429383 -2.28382 0.020883
N  0.004108 0.938374 0.040869
N  -1.646065 -0.745947 0.030652
N  -2.230813 1.629181 0.041391
N  -3.982019 -0.049581 0.030188
C  3.666154 -0.265068 0.005089
C  2.469274 0.711344 -0.001362
C  5.032283 0.45557 -0.034871
C  1.118259 -0.026525 0.040627
C  6.232819 -0.517935 -0.025883
C  7.595118 0.207032 -0.066415
C  -1.310195 0.590056 0.037915
C  -2.98337 -0.990355 0.026469
C  -3.50973 1.214937 0.036278
C  -2.403368 -3.351759 0.018308
H  3.616022 -0.903872 0.911059
H  3.588375 -0.94938 -0.864977
H  2.546772 1.391752 0.871588
H  2.516527 1.344986 -0.910496
H  5.112568 1.142091 0.833634
H  5.086486 1.093282 -0.941709
H  1.053342 -0.664298 0.943686
H  1.016545 -0.700747 -0.831292
H  6.178634 -1.155149 0.880298
H  6.152271 -1.204115 -0.893551
H  7.688613 0.825878 -0.978615
H  7.714877 0.876376 0.806216
H  8.435385 -0.5109 -0.058448
H  0.199287 1.941624 0.050972
H  -2.988044 -4.281979 0.013847
H  -1.770954 -3.280798 0.918754
H  -1.768333 -3.273869 -0.879733
