program: Gaussian 09
title: 000035004
version: EM64L-G09RevD.01
frameworkgroup: C1[X(C9H6Br2N4)]
method: RPBEPBE
basis: SDD
operation: Freq
keyword: #p
keyword: freq=noraman
keyword: PBEPBE/SDD
title: #p freq=noraman PBEPBE/SDD
converged: NO YES NO NO
title: Mulliken charges:
elementType: Br Br N N N N C C C C C C C C C H H H H H H
charge: 0.076809 0.074927 -0.401330 -0.002127 -0.002058 0.112301 0.456331 -0.440157 -0.319073 0.070007 -0.196813 -0.219311 -0.246978 -0.291614 -0.260101 0.345825 0.228143 0.314036 0.233105 0.233277 0.234802
chargesum: 0.00000
title: Mulliken charges with hydrogens summed into heavy atoms:
elementType: Br Br N N N N C C C C C C C C C
charge: 0.076809 0.074927 -0.055505 -0.002127 -0.002058 0.112301 0.456331 -0.212014 -0.005037 0.070007 0.036293 0.013966 -0.012177 -0.291614 -0.260101
polarizability: 2.82093422e+02 -2.92176216e+00 1.93476699e+02 7.53327837e-03 -4.52906586e-02 5.38572531e+01
1716.lowfreq: -0.0007 -0.0004 -0.0004 1.8582 6.6940 7.5663 43.7736 48.2706 68.2884
frequency: 43.6494 48.2600 68.2821 119.1014 121.5727 155.2072 169.5650 187.5976 234.8171 275.6672 325.6369 354.5533 409.1810 409.7010 509.7162 583.3101 601.5695 615.6036 640.8506 672.0534 697.1410 725.2146 753.4579 771.7555 794.3227 828.5180 847.7248 872.4844 926.1891 947.0245 979.6559 986.5049 1007.6684 1029.1772 1089.3056 1129.1864 1162.0889 1175.2894 1192.0274 1238.9625 1263.9973 1305.4871 1342.2792 1390.6784 1441.1433 1445.1596 1487.0634 1499.0391 1565.7774 1607.0838 1615.0700 3116.7040 3138.1345 3150.4450 3169.7908 3195.7970 3509.9656
redmass: 4.0344 7.0064 9.5454 12.2637 23.1529 10.9173 7.9192 8.5868 10.5738 4.5759 9.0915 14.2967 2.9231 10.3228 2.9489 7.3651 12.1021 6.5212 4.2440 8.7460 1.9165 1.5860 10.9492 1.8042 5.3828 6.5461 1.2650 13.0151 1.4139 7.2806 1.3538 6.2440 1.3096 2.1019 1.6802 5.2223 11.1356 1.0570 1.1239 3.0300 7.8470 2.8220 1.6860 10.0752 4.9449 2.6139 2.5413 2.6134 4.7812 4.4651 6.0063 1.0891 1.0871 1.0936 1.0998 1.0953 1.0753
irintensity: 0.0070 0.0003 0.0511 0.4017 0.0897 0.5115 0.0440 5.3068 1.9089 2.0192 3.0429 6.7858 0.0001 1.0926 21.3643 35.3928 0.0722 5.4553 2.5209 20.3911 31.3126 29.2094 132.2801 83.5096 60.1989 40.0615 1.3213 2.7807 13.2842 36.2410 0.0294 0.2221 2.2953 15.3122 40.1508 113.9866 289.9062 0.5328 2.7402 55.2054 47.1682 465.1332 150.4996 57.0164 539.2998 168.0722 24.9263 643.4729 733.4087 157.6201 3.5301 10.6803 0.2138 23.2252 23.4253 12.5071 55.3571
temp: 298.150 k
press: 1.00000 atm
elementType: 35 35 7 7 7 7 6 6 6 6 6 6 6 6 6 1 1 1 1 1 1
symmnumber: 1
zpe: 364521.3 jmol-1
zpe.correction: 0.138839 hartree
zpe.thermalcorrener: 0.151744 hartree
zpe.thermalcorrenthalpy: 0.152689 hartree
zpe.thermalcorrgfe: 0.096138 hartree
zpe.sumelectzpe: -591.431687 hartree
zpe.sumelectthermal: -591.418782 hartree
zpe.sumelectthermalent: -591.417838 hartree
zpe.sumelectthermalfe: -591.474389 hartree
dipole: -4.3152 -1.9221 -0.0004
dipole: 4.7239
quadrupole: -95.7702 -97.7396 -108.0601
quadrupole: 3.3610 0.0114 -0.0166
quadrupole: 4.7531 2.7837 -7.5368 3.3610 0.0114 -0.0166
hfenergy: -591.5705262 hartree
pointgroup: C01 [X(C9H6Br2N4)]
dipole: -1.7559746 0.5966813 0.1209036 debye
dipolederiv: -0.7019671 -0.4510003 -0.0646131 -0.52587 -0.3974576 -0.0556999 -0.0771934 -0.0568178 -0.022527 -0.079884 0.1012128 0.017322 0.2526772 -0.8864929 -0.1450678 0.0416981 -0.1423113 -0.038933 -1.9939868 0.1212954 0.0422215 0.5120581 -0.3211273 -0.0082028 0.1071415 -0.0034325 -0.3133633 -1.5151848 0.507249 0.0999854 1.0580194 -1.0947686 -0.1698346 0.1895019 -0.1610846 -0.1711357 -2.3291043 -0.1241645 0.0085166 -0.1613564 -0.6168437 -0.0707628 0.0002853 -0.0723318 -0.1793803 -1.0342666 -0.5209603 -0.072413 -0.3562778 -1.8431114 -0.2823029 -0.0460956 -0.2800114 -0.1309052 1.163879 0.0977504 0.0012825 0.4429605 0.0967218 -0.0049439 0.0572932 -0.0001666 0.0874761 -0.2760776 -0.0094 -0.0004837 0.0106904 0.0600037 0.0417096 0.0031491 0.0420519 -0.1918186 -0.2224831 -0.0163504 -0.0016744 -0.1500553 -0.1021199 0.0091324 -0.0233957 0.00736 -0.1443174 2.620458 -0.2375428 -0.0704913 -0.9945529 0.8890467 0.1158378 -0.1916164 0.1057698 0.2842613 0.1061474 -0.0425193 -0.0102007 -0.154667 0.0713166 0.035352 -0.0281285 0.0337592 -0.1277325 -0.0363897 0.0161799 0.0013205 0.1319737 0.1502123 0.0447324 0.0198461 0.0463707 -0.1303292 -0.0435588 0.0724921 0.0099328 0.0209108 -0.0947423 0.0119066 0.0013836 0.0111808 -0.1681007 2.3684568 0.5655193 0.0615429 0.5097329 1.6646541 0.2623025 0.0527585 0.261696 0.0609898 1.633808 -0.0557369 -0.0292947 -0.5152554 2.2557371 0.3698836 -0.1039397 0.3628699 0.0844863 0.1746395 0.0108697 0.003727 -0.086955 0.2022087 -0.0159448 -0.0124909 -0.0173063 0.3043511 0.0757361 -0.0869084 -0.0128097 -0.0570217 -0.0834031 -0.0401777 -0.0080646 -0.0397372 0.1632168 0.1873698 0.0373454 0.0057653 0.0842043 0.0581369 -0.0190166 0.0132235 -0.0184068 0.16539 -0.048879 0.0950905 0.0182478 0.1144667 0.0045094 -0.0266331 0.021376 -0.0264274 0.1546676 0.063085 -0.0209275 -0.0021224 -0.0691797 -0.0855351 -0.0379021 -0.0099165 -0.0385688 0.1484179 -0.1117979 -0.0594943 -0.0057615 -0.0665029 0.0730547 -0.0143681 -0.0068153 -0.0144558 0.1652861 unknown
polarizability: 280.9092195|10.7690863|191.036957|-1.2837618|22.1717605|57.4811977 unknown
InChI: InChI=1S/C9H6Br2N4/c10-7-13-8(11)15-9(14-7)12-6-4-2-1-3-5-6/h1-5,12H
charge 0 multiplicity 1
21 atoms
Br 4.595112 1.974397 0.229103
Br 2.503522 -3.189348 -0.585478
N  -0.451586 1.045235 0.142768
N  0.939022 -0.881936 -0.19171
N  1.847385 1.355066 0.163131
N  3.337038 -0.52549 -0.163219
C  -1.764497 0.492439 0.071119
C  -2.84013 1.40744 0.234219
C  -2.031384 -0.88414 -0.148079
C  0.781768 0.46913 0.030479
C  -4.171449 0.95129 0.178493
C  -3.371749 -1.323443 -0.200849
C  -4.446021 -0.419221 -0.039645
C  3.058119 0.794441 0.056014
C  2.220042 -1.288159 -0.273948
H  -0.393232 2.055563 0.307355
H  -2.634387 2.472185 0.403848
H  -1.202944 -1.582522 -0.272776
H  -4.992236 1.665103 0.305376
H  -3.573469 -2.386712 -0.37018
H  -5.480723 -0.774519 -0.082721
