program: Gaussian 09
title: 000005483
version: EM64L-G09RevD.01
frameworkgroup: C1[X(C5H9NO3S)]
method: RPBEPBE
basis: SDD
operation: Freq
keyword: #p
keyword: freq=noraman
keyword: PBEPBE/SDD
title: #p freq=noraman PBEPBE/SDD
converged: YES YES NO NO
title: Mulliken charges:
elementType: S O O O N C C C C C H H H H H H H H H
charge: -0.008227 -0.249161 -0.429078 -0.220814 -0.364143 -0.579368 0.334930 -0.636373 -0.432738 0.210281 0.270079 0.317310 0.267389 0.299822 0.225382 0.266453 0.228754 0.109932 0.389571
chargesum: 0.00000
title: Mulliken charges with hydrogens summed into heavy atoms:
elementType: S O O O N C C C C C
charge: 0.101705 -0.249161 -0.039507 -0.220814 -0.046833 -0.309289 0.334930 0.084216 0.134473 0.210281
polarizability: 1.08513485e+02 -2.20581961e-02 8.89206437e+01 -2.09495735e+00 -4.58593874e-01 6.23378204e+01
1716.lowfreq: -9.9399 -0.0036 -0.0029 0.0013 1.1490 5.3543 15.6197 36.0083 54.8299
frequency: 14.2887 35.9986 54.8069 70.7365 176.5782 190.1481 199.3926 225.8187 258.2219 298.7751 306.6743 372.9582 495.2379 523.4635 559.0448 573.2908 589.4270 651.6370 666.3046 735.4961 802.6465 836.5873 851.8078 987.4442 1018.1331 1064.7987 1074.8281 1080.7684 1137.1603 1193.4922 1214.9000 1234.3755 1299.3041 1324.6433 1341.8790 1395.5701 1442.6961 1464.2738 1470.9623 1486.9758 1628.9539 1672.7591 2415.6634 2996.2596 2999.7120 3025.0729 3049.7034 3094.4611 3118.4299 3517.6917 3558.2180
redmass: 5.7917 9.4890 5.4751 5.6497 2.8658 1.6305 1.5125 1.2506 3.2051 4.6788 5.1180 5.2823 2.0086 4.8010 1.4006 4.2155 3.4370 2.2321 1.8738 5.4860 5.1417 1.1290 3.1542 1.6640 2.1061 2.8585 2.1149 1.8247 2.2824 1.4872 1.6759 1.1645 2.4647 1.3250 1.6292 1.2038 1.0740 1.0437 1.0471 1.8385 6.4954 9.2878 1.0383 1.0600 1.0364 1.0860 1.0996 1.0996 1.1005 1.0641 1.0778
irintensity: 1.6806 0.9937 3.2351 3.3435 5.2508 20.1752 6.6442 9.7310 0.4318 17.1636 0.7365 15.8769 17.5430 17.5491 68.9592 67.2409 18.3168 82.4482 84.4187 5.5521 18.6095 2.2280 18.6495 10.0891 24.3317 5.8514 121.8807 81.4409 7.9192 33.5284 43.6971 76.8119 35.7507 1.2118 18.7459 30.3733 22.6307 15.7088 13.1803 190.6990 141.6592 288.0048 16.5057 45.9305 15.0949 21.6756 6.6659 17.2905 11.0282 32.5878 23.2950
temp: 298.150 k
press: 1.00000 atm
elementType: 16 8 8 8 7 6 6 6 6 6 1 1 1 1 1 1 1 1 1
symmnumber: 1
zpe: 369636.9 jmol-1
zpe.correction: 0.140787 hartree
zpe.thermalcorrener: 0.152739 hartree
zpe.thermalcorrenthalpy: 0.153683 hartree
zpe.thermalcorrgfe: 0.100167 hartree
zpe.sumelectzpe: -873.634432 hartree
zpe.sumelectthermal: -873.622480 hartree
zpe.sumelectthermalent: -873.621536 hartree
zpe.sumelectthermalfe: -873.675052 hartree
dipole: -0.4870 1.5779 3.9773
dipole: 4.3065
quadrupole: -75.0010 -65.8066 -67.3234
quadrupole: -7.1148 0.1000 -3.7728
quadrupole: -5.6240 3.5704 2.0536 -7.1148 0.1000 -3.7728
hfenergy: -873.7752189 hartree
pointgroup: C01 [X(C5H9N1O3S1)]
dipole: 0.1246037 0.6700636 -1.5511789 debye
dipolederiv: -0.0181558 -0.014863 -0.1561016 0.0842903 -0.2818482 0.0045228 -0.1681341 0.0584375 -0.1527004 -0.6557508 0.1166648 -0.0079072 -0.0897805 -0.6128827 0.2860922 0.2396319 0.3409228 -0.6846649 -0.4815717 0.2521171 0.0172718 0.3609667 -1.0505246 0.098573 0.0038953 0.0747136 -0.390769 -1.1529415 0.1879972 -0.1160125 -0.0781414 -0.5537003 -0.0052029 -0.1875455 0.0461092 -0.3505604 -1.0913208 -0.0480344 0.3292464 0.0051177 -0.423793 -0.1146438 0.2735269 -0.032416 -0.5636275 -0.0815618 0.2608303 0.0853094 0.1786708 0.2532507 0.1740785 0.0416302 0.1277795 0.1970115 1.2304644 -0.2523853 -0.4479405 -0.0323396 0.571493 -0.4242251 -0.6068955 -0.5216109 0.8014921 -0.0343592 -0.02681 0.0376732 -0.0539301 -0.0342776 0.0135191 -0.0280073 -0.019008 0.0086332 0.4078886 -0.1150611 -0.0473843 -0.4090954 -0.0102934 0.1166008 0.1903813 0.0546151 0.1156132 1.3993031 -0.2291665 0.2264423 -0.0947284 1.3335232 -0.053845 0.2840623 -0.0524799 0.2675084 0.0074537 -0.0090036 0.0743917 -0.0031836 -0.0283283 -0.0245164 0.0133911 -0.0151399 -0.1542103 0.1588233 0.02741 0.0014873 0.0604271 0.2098143 0.115824 -0.0176967 0.0949288 0.2425142 -0.083036 0.0359338 0.051196 0.0731271 0.0734839 -0.0695065 0.0300964 -0.1009378 0.0358743 0.1867126 -0.0468286 0.0012653 0.0564448 0.1318109 0.0163694 -0.1185846 0.0312061 0.0750644 0.0880069 -0.0301351 0.009377 -0.0611981 -0.0749482 -0.1040524 0.0009056 -0.0953821 0.0432978 0.1345517 -0.0084217 -0.0331027 -0.0174417 0.1060621 0.0246062 0.0268596 0.0424299 -0.0538372 -0.0761711 0.0695596 -0.0357353 0.1286162 0.0376688 0.0336897 -0.0310607 0.0344543 0.0999905 -0.0742769 -0.0843367 0.0713307 -0.060276 0.0537493 -0.0606792 0.1336041 -0.0350484 0.0866463 0.1359413 -0.0854668 -0.060807 -0.0475459 0.29974 -0.0272046 -0.0800603 -0.0335737 0.3767238 unknown
polarizability: 108.1830283|-0.1706834|88.8616566|-4.3928337|1.4030144|62.7272642 unknown
InChI: InChI=1S/C5H9NO3S/c1-3(10)5(9)6-2-4(7)8/h3,6-7,10H,2H2,1H3
charge 0 multiplicity 1
19 atoms
S  -2.249309 1.800593 0.436711
O  -0.896298 -1.437873 0.989841
O  1.916562 1.533014 -0.243012
O  3.680987 0.07502 0.171773
N  0.154853 -0.406503 -0.813721
C  -2.222261 0.084877 -0.436701
C  -0.953978 -0.664506 -0.009155
C  -3.501429 -0.654248 -0.0272
C  1.485033 -0.859927 -0.43264
C  2.484001 0.253836 -0.127481
H  -2.210156 0.28683 -1.522882
H  0.070075 0.261635 -1.581205
H  1.945626 -1.506957 -1.203417
H  1.365789 -1.48097 0.476077
H  -3.580163 -1.60791 -0.579196
H  -3.473492 -0.886294 1.049635
H  -4.395573 -0.046445 -0.248132
H  -0.948242 2.160478 0.110455
H  2.606577 2.216051 -0.021749
