program: Gaussian 09
title: 000035048
version: EM64L-G09RevD.01
frameworkgroup: C1[X(C16H12Br3N5)]
method: RPBEPBE
basis: SDD
operation: Freq
keyword: #p
keyword: freq=noraman
keyword: PBEPBE/SDD
title: #p freq=noraman PBEPBE/SDD
converged: YES YES NO NO
title: Mulliken charges:
elementType: Br Br Br N N N N N C C C C C C C C C C C C C C C C H H H H H H H H H H H H
charge: 0.154608 0.132756 0.154835 -0.408867 -0.408727 -0.140645 -0.064609 -0.063838 0.447983 0.447826 0.024200 0.023631 0.364871 -0.449028 -0.300928 -0.448978 -0.300741 -0.199905 -0.220665 -0.199903 -0.220569 -0.926662 -0.257249 -0.257316 0.331733 0.331751 0.223626 0.314782 0.223639 0.314746 0.228681 0.229171 0.228693 0.229113 0.230989 0.230997
chargesum: 0.00000
title: Mulliken charges with hydrogens summed into heavy atoms:
elementType: Br Br Br N N N N N C C C C C C C C C C C C C C C C
charge: 0.154608 0.132756 0.154835 -0.077134 -0.076976 -0.140645 -0.064609 -0.063838 0.447983 0.447826 0.024200 0.023631 0.364871 -0.225402 0.013854 -0.225339 0.014005 0.028776 0.008506 0.028790 0.008544 -0.926662 -0.026260 -0.026319
polarizability: 4.91787694e+02 1.30060579e-02 2.66281011e+02 1.20495086e-02 4.10607991e+00 1.41477596e+02
1716.lowfreq: -5.6805 -4.3157 0.0002 0.0004 0.0004 3.5084 5.7232 27.0422 39.1241
frequency: 4.9859 27.0420 39.0682 40.7735 51.9739 53.5468 69.7175 71.6674 105.1808 145.9745 155.3304 156.4218 168.9053 174.0107 195.6953 209.8716 225.8038 232.7901 255.2732 277.8167 302.9159 364.0546 400.6139 409.4539 409.4830 508.5150 509.3726 549.8314 575.0185 594.0685 613.1176 616.0755 635.0357 651.3689 678.9993 690.2816 697.1452 700.1981 714.4950 729.8223 737.1055 743.1463 770.2747 770.3585 808.7042 834.5738 845.6659 845.9799 847.9583 901.4379 922.1706 922.4887 975.8877 975.9281 984.6236 985.7871 1002.3616 1007.5947 1007.6644 1023.1230 1028.4548 1031.1087 1088.3444 1093.9823 1172.4372 1172.9784 1190.1267 1190.3728 1211.1804 1219.0445 1247.3907 1287.6738 1323.7910 1326.4712 1354.3519 1380.5452 1394.8643 1424.1803 1429.5358 1446.7709 1469.7546 1483.7589 1492.0846 1511.4285 1537.3268 1576.6529 1601.2046 1609.6364 1614.6834 1614.8285 3112.7243 3112.7605 3134.0171 3134.0474 3146.1590 3146.2007 3166.8213 3166.9121 3193.3853 3193.5408 3518.5660 3519.5797
redmass: 27.6266 6.3080 4.4443 3.7026 10.6784 6.6876 11.4633 6.0736 24.0847 25.2703 10.2503 16.9027 6.6764 9.1939 7.7552 6.5744 14.9792 19.3574 4.1204 4.8159 6.5000 9.0458 8.7267 2.9405 2.9399 2.9602 2.8832 10.2598 7.4121 6.8129 6.4622 6.5973 11.4011 1.9296 10.2641 1.4519 1.9499 2.0425 8.0139 4.2670 2.4238 8.1142 1.6663 1.7073 9.1165 6.0504 1.2738 1.2732 5.3757 13.5288 1.4146 1.4169 1.3471 1.3468 6.1120 6.1987 6.0004 1.3082 1.3076 6.1668 2.3184 2.1066 1.5842 1.6422 1.0666 1.0532 1.1261 1.1257 2.9451 3.2586 2.9541 5.5840 1.4197 1.8054 2.6223 5.6317 7.5148 3.3828 2.6462 2.4713 3.2778 2.4702 3.0775 2.8200 2.7635 5.4245 4.8505 3.9461 6.1007 6.0466 1.0885 1.0885 1.0869 1.0869 1.0935 1.0935 1.0999 1.0998 1.0951 1.0951 1.0750 1.0750
irintensity: 0.0115 0.0737 0.1440 0.0021 0.1379 0.2114 0.1016 0.0223 0.1875 1.0286 0.0258 1.8059 0.1419 0.4965 0.0229 0.9474 0.8360 0.9096 0.0011 2.7328 0.0905 0.3347 10.4866 0.0346 0.0257 25.6161 0.0034 129.9157 35.2009 0.8833 0.1120 22.8511 55.4484 0.2551 114.2446 3.0090 0.1154 80.3601 0.0667 100.0169 0.0325 4.3685 1.9078 224.2455 24.1689 7.2421 0.0171 3.1424 0.2482 5.4640 0.1630 21.2295 0.0350 0.0080 4.6682 0.0112 23.5005 1.7276 2.0915 1.5178 0.8123 9.9095 4.8285 13.1315 0.0002 0.1058 0.6034 2.7635 26.7036 2.0901 0.8000 0.7755 0.0129 63.0212 138.3573 18.8024 32.6712 44.0285 587.9958 2.2744 959.6263 14.2647 9.6675 306.2914 2320.3846 21.2798 137.6435 37.6831 1.9073 15.4884 15.1249 10.4125 0.3835 0.1940 8.5041 49.3291 57.1760 0.4663 35.6653 16.3334 15.9353 75.9507
temp: 298.150 k
press: 1.00000 atm
elementType: 35 35 35 7 7 7 7 7 6 6 6 6 6 6 6 6 6 6 6 6 6 6 6 6 1 1 1 1 1 1 1 1 1 1 1 1
symmnumber: 1
zpe: 663892.9 jmol-1
zpe.correction: 0.252863 hartree
zpe.thermalcorrener: 0.274801 hartree
zpe.thermalcorrenthalpy: 0.275745 hartree
zpe.thermalcorrgfe: 0.195967 hartree
zpe.sumelectzpe: -929.371036 hartree
zpe.sumelectthermal: -929.349099 hartree
zpe.sumelectthermalent: -929.348155 hartree
zpe.sumelectthermalfe: -929.427933 hartree
dipole: -0.0053 4.4811 -0.0976
dipole: 4.4821
quadrupole: -142.5624 -145.3261 -173.8193
quadrupole: -0.0015 0.0038 1.2198
quadrupole: 11.3402 8.5765 -19.9167 -0.0015 0.0038 1.2198
hfenergy: -929.6238999 hartree
pointgroup: C01 [X(C16H12Br3N5)]
dipole: 0.0024259 1.7417661 0.2754287 debye
polarizability: 491.7875656|-0.0811436|265.1140008|0.1915553|12.6943553|142.6447345 unknown
InChI: InChI=1S/C16H12Br3N5/c17-16(18,19)13-22-14(20-11-7-3-1-4-8-11)24-15(23-13)21-12-9-5-2-6-10-12/h1-10,20-21H
charge 0 multiplicity 1
36 atoms
Br -1.624383 -3.696485 0.322726
Br -0.016773 -3.050206 -2.475523
Br 1.632926 -3.698461 0.297395
N  -2.313165 1.423851 0.11182
N  2.316537 1.421804 0.113879
N  0.001692 1.411197 0.110798
N  1.212184 -0.688735 -0.130619
N  -1.210354 -0.687577 -0.13155
C  -3.686363 1.048111 0.078199
C  3.689406 1.044812 0.081666
C  -1.158354 0.683607 0.025886
C  1.161088 0.682705 0.026768
C  0.000738 -1.288067 -0.201035
C  -4.631484 2.105981 0.182725
C  -4.140286 -0.291487 -0.046713
C  4.635396 2.101573 0.189537
C  4.142182 -0.294971 -0.045275
C  -6.012817 1.830096 0.162887
C  -5.527822 -0.549211 -0.065312
C  6.016484 1.824391 0.171019
C  5.529489 -0.5540 -0.062461
C  -0.000951 -2.808046 -0.456565
C  -6.471751 0.49794 0.038239
C  6.47429 0.49203 0.044422
H  -2.122263 2.42403 0.222952
H  2.126465 2.422126 0.225215
H  -4.283736 3.142922 0.278956
H  -3.413271 -1.10087 -0.126794
H  4.288504 3.138649 0.287415
H  3.414469 -1.103488 -0.127861
H  -6.728816 2.655161 0.244218
H  -5.870467 -1.585445 -0.163001
H  6.733171 2.648597 0.254962
H  5.871289 -1.590368 -0.161723
H  -7.545115 0.282129 0.022266
H  7.547464 0.275205 0.029482
