program: Gaussian 09
title: 000005509
version: EM64L-G09RevD.01
frameworkgroup: C1[X(C15H15NO3)]
method: RPBEPBE
basis: SDD
operation: Freq
keyword: #p
keyword: freq=noraman
keyword: PBEPBE/SDD
title: #p freq=noraman PBEPBE/SDD
converged: YES YES NO NO
title: Mulliken charges:
elementType: O O O N C C C C C C C C C C C C C C C H H H H H H H H H H H H H H H
charge: -0.263106 -0.403602 -0.233280 -0.204572 0.354597 0.242122 -0.408284 -0.364430 -0.619653 -0.003028 -0.658342 0.315572 -0.372442 -0.358043 0.433722 -0.409397 -0.378137 0.224659 -0.807101 0.258158 0.280152 0.252782 0.264124 0.280203 0.265701 0.237802 0.267350 0.268405 0.232300 0.231881 0.228537 0.225828 0.238954 0.380569
chargesum: 0.00000
title: Mulliken charges with hydrogens summed into heavy atoms:
elementType: O O O N C C C C C C C C C C C C C C C
charge: -0.263106 -0.023033 -0.233280 -0.204572 0.354597 0.242122 -0.150126 -0.084278 -0.102747 -0.003028 0.125363 0.315572 -0.105092 -0.089637 0.433722 -0.177098 -0.146256 0.224659 -0.113782
polarizability: 2.90339402e+02 -2.23275418e+00 1.73061714e+02 -7.25835740e+00 4.47570929e+00 1.10944289e+02
1716.lowfreq: -48.7778 -4.3065 -0.0006 -0.0004 0.0004 4.1517 8.0017 22.2701 30.4589
frequency: -48.5820 22.2452 30.4436 34.1380 50.0082 61.5230 83.0567 89.2735 114.0239 156.8909 191.0817 228.2660 236.0564 272.3127 287.8341 323.8760 347.2280 379.5728 406.0862 410.9715 426.8581 481.3561 511.6019 537.2475 578.0778 610.9933 622.0602 635.4657 646.6735 666.6972 700.6160 712.8021 748.6598 769.8121 786.6657 795.1268 842.9367 852.4842 859.5826 871.7928 884.2261 921.1492 961.5451 971.0914 984.4136 990.9372 1013.5061 1046.7779 1047.1171 1057.3970 1123.3931 1125.0859 1136.7574 1156.0421 1188.5197 1195.5028 1214.6497 1224.1310 1260.6757 1281.3003 1307.5054 1325.3428 1349.4019 1367.5799 1368.4496 1397.0929 1407.1494 1411.7243 1447.1585 1461.0546 1468.6697 1472.4465 1473.4730 1478.6026 1489.6349 1502.1125 1510.4498 1538.8896 1577.6880 1618.6445 1657.6566 2975.7167 3000.1754 3027.4958 3056.7701 3086.7457 3093.2591 3109.7667 3122.1445 3124.7952 3147.7897 3154.2867 3158.3685 3212.9618 3236.3657 3506.5096
redmass: 1.2905 1.0176 5.7194 6.8363 3.8022 4.3702 3.8657 5.1526 4.8856 5.2946 5.2827 4.2580 4.4290 4.6688 3.4579 5.4647 3.3324 4.4615 2.4574 2.7607 3.7805 2.9540 3.6227 4.4103 2.9807 3.9565 4.2480 6.6660 4.5400 1.8216 4.3264 4.2533 2.1794 2.4803 4.0817 2.5510 1.6496 3.4302 1.4748 4.6188 1.4874 2.0149 2.6765 1.3511 1.3981 1.4006 2.7742 1.5117 1.5166 1.6887 1.3108 1.3133 1.9959 2.0697 1.3802 1.4576 1.5349 2.8229 3.6222 1.4549 1.2949 2.0778 4.4176 5.4452 4.9251 1.2270 3.4765 2.4644 1.1028 1.9311 1.1414 1.1182 1.0855 1.7984 1.7170 2.7052 3.7408 5.2854 6.3296 6.3113 8.3505 1.0386 1.0383 1.0626 1.0950 1.0998 1.1001 1.0997 1.0888 1.0890 1.0991 1.0944 1.0959 1.0933 1.1035 1.0639
irintensity: 0.4791 0.6488 1.0723 1.6335 0.0684 2.0212 0.5915 2.1517 1.7234 1.0391 2.4546 3.3579 2.7877 4.0314 4.8217 4.1731 2.5762 1.2038 1.7046 1.5204 3.8173 13.0038 71.1326 2.1800 44.3125 1.4628 4.1313 1.3957 2.6530 124.4119 24.4320 18.5658 61.6820 7.5731 14.5090 18.9445 27.9096 10.3623 5.8550 56.0338 8.2663 29.9541 37.2098 1.4551 0.2805 9.1070 1.7529 22.1209 15.7536 260.0022 13.7517 3.0671 16.5719 19.8022 73.8288 9.9648 1.0646 1.7388 159.3501 18.7670 4.2481 48.0662 8.5883 54.7388 100.3831 11.3306 1.5851 52.0553 20.9159 122.5456 13.7826 3.6755 28.7032 80.5338 55.8610 7.7733 97.9908 80.8527 16.8155 65.9966 210.7966 33.3914 32.9853 13.5763 21.3218 16.8896 6.1033 2.4272 15.3203 21.9974 1.1954 15.7329 2.0637 4.5130 0.6476 27.5094
temp: 298.150 k
press: 1.00000 atm
elementType: 8 8 8 7 6 6 6 6 6 6 6 6 6 6 6 6 6 6 6 1 1 1 1 1 1 1 1 1 1 1 1 1 1 1
symmnumber: 1
zpe: 698681.9 jmol-1
zpe.correction: 0.266114 hartree
zpe.thermalcorrener: 0.283609 hartree
zpe.thermalcorrenthalpy: 0.284553 hartree
zpe.thermalcorrgfe: 0.217865 hartree
zpe.sumelectzpe: -859.669092 hartree
zpe.sumelectthermal: -859.651597 hartree
zpe.sumelectthermalent: -859.650653 hartree
zpe.sumelectthermalfe: -859.717340 hartree
dipole: 0.6509 -3.0650 -0.7725
dipole: 3.2272
quadrupole: -83.8239 -109.1655 -114.6047
quadrupole: 1.6208 -3.1951 -4.8042
quadrupole: 18.7074 -6.6341 -12.0733 1.6208 -3.1951 -4.8042
hfenergy: -859.9352056 hartree
pointgroup: C01 [X(C15H15N1O3)]
dipole: -0.300797 -1.0996715 0.5588734 debye
polarizability: 290.4591283|-3.1372412|168.1717252|-5.4023623|-17.2513037|115.7145522 unknown
InChI: InChI=1S/C15H15NO3/c1-10-3-5-11(6-4-10)15(19)13-8-7-12(16(13)2)9-14(17)18/h3-8,17H,9H2,1-2H3
charge 0 multiplicity 1
34 atoms
O  0.749358 2.318342 -0.662902
O  -5.366137 -1.653823 -0.111553
O  -4.672374 -0.187788 -1.773466
N  -1.751549 0.887843 -0.026481
C  -2.664329 0.140256 0.713317
C  -0.443475 0.462429 0.298767
C  -1.949136 -0.766166 1.525157
C  -0.566608 -0.570346 1.26524
C  -4.160806 0.314091 0.603879
C  0.773313 1.12389 -0.196598
C  -2.122946 1.925092 -1.012912
C  2.080481 0.383832 -0.126386
C  2.18721 -1.027569 -0.241595
C  3.273124 1.14887 -0.01827
C  4.645147 -0.893845 -0.101463
C  3.45305 -1.651698 -0.230817
C  4.530784 0.519421 0.00569
C  -4.740051 -0.48685 -0.560762
C  6.006142 -1.565992 -0.111711
H  -2.397406 -1.47188 2.222558
H  0.267204 -1.068192 1.755268
H  -4.427729 1.37428 0.446972
H  -4.629117 -0.030102 1.538067
H  -1.283406 2.086261 -1.700889
H  -3.012277 1.595369 -1.573828
H  -2.320847 2.887614 -0.50797
H  1.284594 -1.632943 -0.372758
H  3.184664 2.238769 0.04175
H  3.518047 -2.741856 -0.332405
H  5.439542 1.125607 0.105292
H  6.704177 -1.07691 0.591044
H  5.934695 -2.633065 0.161275
H  6.466007 -1.511711 -1.117824
H  -5.697648 -2.175928 -0.892785
