program: Gaussian 09
title: 000005591
version: EM64L-G09RevD.01
frameworkgroup: C1[X(C24H27NO5S)]
method: RPBEPBE
basis: SDD
operation: Freq
keyword: #p
keyword: freq=noraman
keyword: PBEPBE/SDD
title: #p freq=noraman PBEPBE/SDD
converged: YES YES NO NO
title: Mulliken charges:
elementType: S O O O O O N C C C C C C C C C C C C C C C C C C C C C C C C H H H H H H H H H H H H H H H H H H H H H H H H H H H
charge: 0.254417 -0.302467 -0.280249 -0.439810 -0.204947 -0.148619 -0.333039 0.329951 -0.473637 -0.552740 0.296231 -0.103160 -0.386356 -0.747560 0.153113 0.159718 0.235941 -0.075786 -0.837023 -0.856335 -0.904393 0.365739 0.483963 -0.388797 -0.343774 -0.549061 -0.584685 -0.373411 -0.395305 0.268966 -0.089852 0.230807 0.223184 0.237003 0.232833 0.247202 0.228824 0.228383 0.223858 0.230890 0.281202 0.223964 0.220679 0.226806 0.221111 0.278129 0.236737 0.232666 0.272622 0.367877 0.258245 0.241568 0.249947 0.259017 0.327025 0.237273 0.239432 0.365679
chargesum: 0.00000
title: Mulliken charges with hydrogens summed into heavy atoms:
elementType: S O O O O O N C C C C C C C C C C C C C C C C C C C C C C C C
charge: 0.254417 -0.302467 -0.280249 -0.071933 -0.204947 -0.148619 0.032640 0.329951 -0.019645 -0.082904 0.296231 -0.103160 0.089670 -0.064428 0.153113 0.159718 0.235941 -0.075786 -0.111178 -0.130289 -0.162367 0.365739 0.483963 -0.138850 -0.084757 -0.049248 -0.257660 -0.136139 -0.155873 0.268966 -0.089852
polarizability: 3.69394738e+02 -1.45597313e+01 3.13933950e+02 2.46660459e+01 -1.60520717e+01 2.37998457e+02
1716.lowfreq: -4.2068 -1.5445 0.0012 0.0015 0.0016 5.6971 9.6174 12.9445 22.3605
frequency: 9.4439 12.4365 22.3212 28.1904 37.2757 43.8909 60.1941 63.3459 89.6578 103.1944 115.1989 125.1131 129.7496 140.4474 148.5839 159.4434 160.6994 166.8370 193.9091 197.7270 201.3012 215.0507 232.4605 252.1388 263.5864 276.5301 280.5626 308.8168 330.0536 337.7079 343.3800 345.9202 349.4662 373.5568 388.5099 395.9645 402.2057 415.5943 436.2731 439.0918 458.1668 469.6529 481.5968 494.4667 525.3527 534.4517 557.8563 563.7493 567.6763 580.3999 593.6407 597.2886 615.6335 632.5421 634.0011 659.2322 665.6114 691.5858 725.4840 734.0013 743.1367 752.5366 776.3901 798.8327 819.3582 826.7258 833.5830 835.6243 886.6791 909.6656 915.4710 931.3392 936.2170 952.9941 963.4932 968.3855 980.8194 997.4168 1003.0790 1019.6858 1024.9190 1027.6916 1028.3971 1032.1020 1041.7370 1048.9705 1062.8438 1081.3414 1095.2837 1104.3718 1110.9113 1125.8656 1147.7903 1152.7976 1164.3309 1180.7259 1205.8100 1217.1662 1218.2725 1227.2341 1235.3556 1242.9932 1254.0939 1261.0237 1271.2985 1283.2605 1307.9076 1323.5435 1324.0496 1340.6333 1352.8938 1354.2901 1362.9054 1380.2778 1384.6118 1388.2914 1389.8054 1396.3024 1400.3015 1408.9210 1420.0998 1450.9892 1455.4036 1457.2069 1463.8392 1466.5828 1468.1064 1473.0590 1478.6466 1480.0516 1483.3895 1487.3192 1494.5816 1502.7759 1503.0222 1583.8742 1586.9950 1623.7130 1627.2301 1650.8448 1685.9192 2947.7620 2962.0034 2971.0771 2971.3677 2975.5021 2994.4308 2995.6475 3003.9225 3011.2566 3027.3129 3036.1118 3041.5928 3045.5044 3048.6161 3066.0524 3075.4255 3094.8883 3103.5238 3108.0853 3116.1392 3116.8309 3119.9452 3131.1088 3163.8549 3168.0511 3531.0587 3590.4723
redmass: 7.2661 7.2558 4.5933 7.9420 5.4509 5.5839 5.3133 6.1059 4.3696 3.1926 2.2089 1.3730 1.2892 5.1813 1.7057 6.6888 4.5627 1.3540 1.9483 2.0350 2.1175 2.9068 1.6406 1.6738 3.6389 3.3770 3.7707 2.9656 3.3095 3.4066 3.5912 3.2606 5.1889 4.1375 3.3276 3.0502 4.2554 2.9980 13.5178 4.4355 4.2820 4.7815 4.6314 4.5291 3.3777 3.1806 4.3262 8.5570 3.9301 5.1269 3.6466 4.7581 6.0233 6.1930 6.4170 4.3817 3.0379 3.4400 3.5152 3.5726 1.8015 3.6844 4.4004 2.8076 1.4114 3.0909 1.8705 2.3614 3.0079 3.1324 2.2097 1.6351 1.8775 1.6432 1.3883 1.4878 6.8171 1.7808 2.8111 1.8839 1.4277 4.4446 1.8570 1.7399 1.6115 1.5532 2.6840 2.4672 2.5663 2.3001 1.3352 4.3674 1.1050 1.5292 1.4160 1.2700 1.5071 1.4633 1.7631 4.3666 1.4011 3.4323 2.0664 2.0405 2.1882 1.8937 1.3158 1.8725 1.5615 3.7141 1.6316 1.5065 1.6280 3.9712 2.0414 1.7629 1.2710 1.2799 1.4375 2.5023 3.2676 1.1769 1.2912 1.1349 1.1056 1.2272 1.1212 1.1214 1.2427 1.0578 1.0965 1.1219 1.4504 1.5000 1.4076 6.9540 7.1468 6.4344 7.2067 7.5923 12.2876 1.0425 1.0666 1.0427 1.0533 1.0400 1.0361 1.0603 1.0649 1.0976 1.0914 1.1069 1.0958 1.0976 1.0882 1.0979 1.1005 1.0997 1.1000 1.0913 1.0956 1.0947 1.0896 1.0896 1.0945 1.0945 1.0780 1.0652
irintensity: 0.0226 0.1082 0.0732 0.0890 0.1842 0.0578 0.3126 0.2524 0.3812 0.2041 1.6573 0.6588 0.2521 2.6527 0.5543 9.5297 0.6547 2.1224 2.6245 0.9047 1.9561 0.9339 72.9999 43.6315 6.5946 0.6436 2.1810 3.9595 3.7798 3.5370 0.6245 5.6468 13.2878 1.3045 0.3632 2.3307 4.5159 0.1542 8.4410 0.6256 3.1914 1.1222 14.3703 5.7239 17.3723 10.1426 10.1031 6.9679 9.1336 0.5885 2.3677 3.8896 29.2233 2.3440 4.3368 32.2232 15.4941 14.8988 13.1876 4.4916 96.0999 5.2432 10.8758 25.1149 22.5653 13.4520 27.6171 14.3226 32.3024 2.1343 2.9759 3.9299 6.6698 2.8695 1.0164 3.1271 115.8674 7.8286 8.8322 1.1007 4.8500 3.3041 3.4764 98.5521 2.8291 0.2078 77.3906 112.4367 58.8387 42.7434 6.9699 145.1268 21.2911 27.5541 41.7717 115.1134 141.8086 47.3701 35.9761 292.0946 7.8302 40.1652 0.5772 87.3977 96.9150 19.4627 5.1352 1.8014 6.7151 2.6541 3.9267 9.6248 8.8860 34.5001 31.0354 23.8004 9.7437 25.5012 47.5773 30.3906 3.1222 12.9838 17.2616 11.6977 13.0860 7.7951 30.4935 9.7683 35.7834 35.8914 53.2835 14.2792 16.8530 76.0498 55.2934 15.3578 2.1271 80.2756 0.2871 481.8094 345.2137 47.9869 32.2634 20.7209 33.3355 39.6571 12.7883 12.1790 22.1773 22.1700 48.2214 26.1658 16.6344 22.6707 0.9764 7.5023 23.8487 23.3812 31.5027 11.3752 7.2236 3.1122 13.7528 18.2929 8.1597 6.6914 67.2745 32.1772
temp: 298.150 k
press: 1.00000 atm
elementType: 16 8 8 8 8 8 7 6 6 6 6 6 6 6 6 6 6 6 6 6 6 6 6 6 6 6 6 6 6 6 6 1 1 1 1 1 1 1 1 1 1 1 1 1 1 1 1 1 1 1 1 1 1 1 1 1 1 1
symmnumber: 1
zpe: 1210932.9 jmol-1
zpe.correction: 0.461220 hartree
zpe.thermalcorrener: 0.492085 hartree
zpe.thermalcorrenthalpy: 0.493029 hartree
zpe.thermalcorrgfe: 0.396064 hartree
zpe.sumelectzpe: -1757.444939 hartree
zpe.sumelectthermal: -1757.414074 hartree
zpe.sumelectthermalent: -1757.413130 hartree
zpe.sumelectthermalfe: -1757.510095 hartree
dipole: -1.8805 -1.5447 -0.9602
dipole: 2.6161
quadrupole: -190.7273 -201.7761 -182.3247
quadrupole: -10.6211 8.2987 -7.3274
quadrupole: 0.8820 -10.1667 9.2847 -10.6211 8.2987 -7.3274
hfenergy: -1757.906159 hartree
pointgroup: C01 [X(C24H27N1O5S1)]
dipole: 0.7591455 0.6024795 -0.3465437 debye
polarizability: 369.6415795|-15.3678317|313.5681253|-22.3001971|18.4347531|238.1174404 unknown
InChI: InChI=1S/C24H27NO5S/c1-13-14(2)21-18(15(3)20(13)26)9-10-24(4,30-21)12-29-17-7-5-16(6-8-17)11-19-22(27)25-23(28)31-19/h5-8,19,25-26H,9-12H2,1-4H3
charge 0 multiplicity 1
58 atoms
S  -5.024655 -1.71298 -0.140091
O  3.834334 1.481192 -0.524422
O  0.33344 2.246804 0.445639
O  5.240601 -3.819555 0.752072
O  -8.090217 0.842481 0.183668
O  -6.946902 -3.619952 -0.730234
N  -7.67881 -1.422077 -0.280101
C  2.760401 2.171672 0.251034
C  2.920334 1.858305 1.751704
C  2.860246 0.343215 2.028627
C  3.714067 -0.45094 1.049138
C  4.160818 0.141615 -0.160752
C  1.427419 1.645106 -0.334903
C  2.948685 3.661013 -0.055058
C  4.077592 -1.793912 1.340635
C  4.990184 -0.551484 -1.085311
C  5.365595 -1.887641 -0.785037
C  4.894852 -2.485205 0.417064
C  3.613026 -2.476871 2.613506
C  5.449781 0.141985 -2.357798
C  6.256168 -2.702769 -1.710712
C  -0.982397 1.921835 0.083276
C  -3.722765 1.400161 -0.484408
C  -1.997835 2.528448 0.865222
C  -1.330502 1.058572 -0.984304
C  -5.188576 1.104769 -0.757445
C  -5.766878 0.013655 0.185263
C  -3.349127 2.265814 0.579811
C  -2.69497 0.808217 -1.255443
C  -7.290402 -0.114167 0.042905
C  -6.708275 -2.435654 -0.437535
H  2.132255 2.385844 2.31646
H  3.899634 2.261674 2.071825
H  1.807506 -0.005899 1.99019
H  3.197726 0.147064 3.063401
H  1.37799 0.540546 -0.269573
H  1.349958 1.946936 -1.398185
H  3.896885 4.025781 0.375098
H  2.97703 3.828037 -1.146213
H  2.112084 4.241626 0.370306
H  3.8825 -3.543073 2.598132
H  4.079338 -2.022701 3.510136
H  2.517533 -2.393352 2.742029
H  6.55144 0.244369 -2.389523
H  5.145274 -0.420018 -3.261067
H  5.016185 1.150468 -2.419726
H  7.189105 -3.026903 -1.204856
H  5.742557 -3.61159 -2.088396
H  6.562057 -2.124288 -2.594748
H  5.784906 -4.224841 0.033409
H  -5.805057 2.009956 -0.593722
H  -5.340403 0.785594 -1.804372
H  -1.705573 3.1995 1.678679
H  -0.563381 0.584423 -1.602757
H  -5.535037 0.269026 1.233766
H  -4.127115 2.749814 1.183806
H  -2.959087 0.136738 -2.080915
H  -8.66784 -1.654283 -0.412391
