program: Gaussian 09
title: 000034957
version: EM64L-G09RevD.01
frameworkgroup: C1[X(C11H6Cl6N4)]
method: RPBEPBE
basis: SDD
operation: Freq
keyword: #p
keyword: freq=noraman
keyword: PBEPBE/SDD
title: #p freq=noraman PBEPBE/SDD
converged: YES YES NO NO
title: Mulliken charges:
elementType: Cl Cl Cl Cl Cl Cl N N N N C C C C C C C C C C C H H H H H H
charge: 0.116249 0.125347 0.132177 0.115523 0.132794 0.126658 -0.397919 -0.038418 -0.043462 0.077651 -0.001540 0.464807 0.277854 0.317502 -0.445947 -0.327241 -0.786007 -0.784451 -0.196407 -0.217287 -0.246303 0.347334 0.229031 0.318816 0.234123 0.233402 0.235712
chargesum: 0.00000
title: Mulliken charges with hydrogens summed into heavy atoms:
elementType: Cl Cl Cl Cl Cl Cl N N N N C C C C C C C C C C C
charge: 0.116249 0.125347 0.132177 0.115523 0.132794 0.126658 -0.050584 -0.038418 -0.043462 0.077651 -0.001540 0.464807 0.277854 0.317502 -0.216916 -0.008424 -0.786007 -0.784451 0.037716 0.016115 -0.010591
polarizability: 3.28062408e+02 -2.61595475e+01 2.17396574e+02 3.89949038e-03 -2.52676792e-01 1.30778855e+02
1716.lowfreq: -6.5100 -2.9460 -0.0024 -0.0015 0.0006 3.6169 7.7264 8.7345 37.6275
frequency: 7.2976 8.5033 37.6164 45.8421 57.2323 68.4558 78.3509 109.1139 151.3359 165.0454 169.2126 179.3787 200.5845 210.3670 223.2164 251.9617 268.5813 273.3042 283.4779 308.7564 313.5268 349.6502 384.4799 394.2498 408.7810 448.5548 510.3557 585.6543 607.2976 614.3334 640.7758 654.2351 669.3426 697.1050 709.1229 742.6236 758.9540 766.7354 769.4192 779.7866 800.3429 836.1375 839.6902 848.5596 900.5814 928.1657 980.5674 985.6043 1003.3245 1008.8818 1020.4180 1031.7155 1092.9719 1167.5359 1175.8969 1192.1712 1241.8248 1285.7380 1308.1792 1336.9945 1370.6860 1398.3422 1445.5725 1466.7137 1489.1202 1509.2550 1564.7425 1605.8574 1613.2689 3115.9805 3138.5253 3151.3977 3170.4667 3194.2359 3504.5749
redmass: 30.7203 23.4696 5.0196 5.9080 8.7315 11.2126 23.3861 18.8189 18.1845 11.6000 7.7665 28.6575 9.3855 15.0591 22.3918 27.0780 6.8145 12.2708 13.7688 12.2869 12.2654 15.3985 22.1015 20.2345 2.9224 12.3853 2.9510 7.5373 13.3518 6.5672 6.9006 11.0511 10.2040 1.8558 2.0575 11.0192 2.8697 11.1277 8.6816 1.7954 10.5250 10.2591 6.0391 1.2740 13.7151 1.4155 1.3548 6.1953 8.6096 1.3116 6.0940 2.4202 1.6255 4.4970 1.1047 1.1211 3.2727 4.9422 4.0759 1.9696 4.3996 7.1925 2.5324 4.1734 2.5749 3.5171 5.0480 4.5317 5.9788 1.0893 1.0870 1.0934 1.0998 1.0956 1.0752
irintensity: 0.0050 0.0050 0.0230 0.0013 0.1784 0.1545 0.0361 0.1846 0.3810 3.3150 0.2087 0.0680 0.6062 0.5663 0.2656 0.1638 1.8207 0.3277 0.4392 1.4528 0.2361 1.3875 1.1915 0.4576 0.0062 1.9583 17.5842 33.9254 0.8233 8.4884 163.9497 101.7747 41.7076 49.6553 25.6936 125.8625 45.7359 50.7299 4.8421 218.7164 27.1857 0.9481 27.7681 2.4661 37.0566 11.7783 0.0322 1.3163 56.1412 2.0108 25.3975 3.4805 7.3265 4.8925 0.2291 2.2088 4.4377 60.1114 19.3479 6.1983 93.0403 75.1414 8.7684 228.0295 4.3545 510.7070 696.1374 145.2228 8.2570 9.9333 0.3340 22.2469 22.5839 20.2226 56.5423
temp: 298.150 k
press: 1.00000 atm
elementType: 17 17 17 17 17 17 7 7 7 7 6 6 6 6 6 6 6 6 6 6 6 1 1 1 1 1 1
symmnumber: 1
zpe: 410478.6 jmol-1
zpe.correction: 0.156343 hartree
zpe.thermalcorrener: 0.176692 hartree
zpe.thermalcorrenthalpy: 0.177637 hartree
zpe.thermalcorrgfe: 0.101549 hartree
zpe.sumelectzpe: -3400.608528 hartree
zpe.sumelectthermal: -3400.588179 hartree
zpe.sumelectthermalent: -3400.587235 hartree
zpe.sumelectthermalfe: -3400.663322 hartree
dipole: 4.8765 -2.7851 -0.0052
dipole: 5.6158
quadrupole: -151.1779 -157.5849 -163.7476
quadrupole: -8.6128 -0.1105 -0.3257
quadrupole: 6.3255 -0.0814 -6.2441 -8.6128 -0.1105 -0.3257
hfenergy: -3400.7648711 hartree
pointgroup: C01 [X(C11H6Cl6N4)]
dipole: 2.0288627 0.8719777 -0.0704726 debye
polarizability: 332.4845708|13.1555961|212.4404748|-1.553603|-6.6004979|131.3127903 unknown
InChI: InChI=1S/C11H6Cl6N4/c12-10(13,14)7-19-8(11(15,16)17)21-9(20-7)18-6-4-2-1-3-5-6/h1-5,18H
charge 0 multiplicity 1
27 atoms
Cl -1.972113 -3.361082 -1.359928
Cl 0.370758 -3.592894 0.531072
Cl -2.394491 -3.157875 1.637969
Cl -4.267399 1.460658 1.529583
Cl -3.07464 3.456391 -0.396667
Cl -4.469751 1.009188 -1.464918
N  1.396639 1.341447 -0.090069
N  -0.914436 1.486393 -0.101307
N  0.15398 -0.699735 0.085104
N  -2.259242 -0.51432 0.072062
C  0.208564 0.670686 -0.032334
C  2.745963 0.881725 -0.053986
C  -2.091808 0.840353 -0.047889
C  -1.095167 -1.215283 0.134448
C  3.750823 1.883988 -0.136238
C  3.112208 -0.485377 0.055373
C  -1.244507 -2.740048 0.24306
C  -3.385528 1.662091 -0.103571
C  5.11199 1.524309 -0.11083
C  4.48154 -0.82673 0.078868
C  5.486088 0.164236 -0.003329
H  1.264682 2.355047 -0.17523
H  3.46645 2.940895 -0.220134
H  2.338378 -1.251576 0.119757
H  5.878038 2.304175 -0.1749
H  4.76192 -1.882282 0.162806
H  6.544062 -0.116784 0.016229
