program: Gaussian 09
title: 000034962
version: EM64L-G09RevD.01
frameworkgroup: C1[X(C11H3Cl9N4)]
method: RPBEPBE
basis: SDD
operation: Freq
keyword: #p
keyword: freq=noraman
keyword: PBEPBE/SDD
title: #p freq=noraman PBEPBE/SDD
converged: YES YES NO NO
title: Mulliken charges:
elementType: Cl Cl Cl Cl Cl Cl Cl Cl Cl N N N N C C C C C C C C C C C H H H
charge: -0.023723 0.124455 0.141329 0.127536 0.130600 0.135047 0.130041 0.016518 0.020105 -0.397988 -0.063324 -0.024508 0.091115 0.669056 0.010965 0.324849 0.275196 -0.441514 -0.220149 -0.789400 -0.790807 -0.108381 -0.205108 -0.130220 0.356301 0.354340 0.287670
chargesum: 0.00000
title: Mulliken charges with hydrogens summed into heavy atoms:
elementType: Cl Cl Cl Cl Cl Cl Cl Cl Cl N N N N C C C C C C C C C C C
charge: -0.023723 0.124455 0.141329 0.127536 0.130600 0.135047 0.130041 0.016518 0.020105 -0.041687 -0.063324 -0.024508 0.091115 0.669056 0.010965 0.324849 0.275196 -0.441514 0.134191 -0.789400 -0.790807 -0.108381 0.082561 -0.130220
polarizability: 3.82724014e+02 2.71741285e+00 2.65645308e+02 -1.52416354e-01 -1.47006376e-02 1.38259101e+02
1716.lowfreq: -8.7413 -3.3411 -2.8453 -0.0027 -0.0026 0.0009 3.3500 7.8761 17.6589
frequency: -7.5162 6.0944 17.6391 33.1271 38.9826 58.1786 74.7186 81.2171 107.4965 112.6016 137.8801 141.2458 155.0129 180.3806 182.3003 200.5770 208.7758 210.8040 224.3299 248.1904 252.1743 252.5934 279.9056 294.2761 309.7280 311.0692 331.4885 373.1326 380.0389 383.0751 425.4815 451.5603 454.6159 484.6102 538.3267 609.3818 612.6639 639.6900 646.3436 658.3102 674.7946 704.5729 731.6569 735.3698 749.1485 769.8020 782.0087 791.2301 805.6135 840.9654 857.5431 898.3463 905.8408 936.6128 1006.4037 1019.1796 1040.1037 1117.3157 1174.7368 1236.9559 1242.4896 1287.6336 1312.0178 1357.8256 1371.4283 1396.3131 1441.0718 1475.8794 1502.7115 1538.5454 1582.4440 1600.4603 3173.1269 3184.2464 3453.8179
redmass: 32.8346 33.2645 26.4381 14.7208 24.4078 24.9851 28.1441 14.7436 19.4338 21.7037 11.6471 28.5538 31.6842 33.6420 30.7846 7.4026 15.5445 20.4976 21.7323 20.6916 7.7361 26.4974 23.1532 17.9162 19.1068 25.5291 22.1404 8.8714 27.9744 23.1383 13.9985 3.3246 12.1482 7.1307 9.3542 13.0779 9.1840 8.9624 8.5257 11.9748 8.8906 2.9539 9.2716 4.5222 11.6738 11.5673 11.5110 1.7352 10.3649 9.5996 1.4245 8.6202 12.4384 1.3717 10.1612 9.6234 4.9516 1.9328 6.8883 1.4754 3.2698 7.0411 9.2675 6.9129 7.6119 4.5270 3.8468 4.3700 4.3334 9.5755 4.7160 5.3889 1.0932 1.0933 1.0754
irintensity: 0.0215 0.0124 0.0229 0.1171 0.0929 0.1737 0.0326 0.0221 0.0312 0.4347 0.2117 0.0051 1.0889 0.0738 0.1092 0.5376 0.3311 1.7685 0.1180 0.1799 0.9371 0.0829 0.0022 1.3145 0.3968 0.6010 6.3667 0.0006 2.0281 2.1939 2.7771 15.7211 8.7041 3.4067 59.4511 0.8192 0.2818 17.7370 167.4543 82.8705 73.6529 13.6230 5.0741 51.7849 128.0260 4.0700 76.1787 147.5829 26.3591 0.0084 15.4291 31.2124 27.7497 29.2152 49.0511 85.1785 13.3416 31.6768 8.3801 14.4220 21.8761 52.1875 27.0500 107.6259 30.8538 104.0168 230.3229 138.8328 448.2039 640.1262 428.3238 176.3206 66.6420 0.4935 114.8221
temp: 298.150 k
press: 1.00000 atm
elementType: 17 17 17 17 17 17 17 17 17 7 7 7 7 6 6 6 6 6 6 6 6 6 6 6 1 1 1
symmnumber: 1
zpe: 333795.4 jmol-1
zpe.correction: 0.127136 hartree
zpe.thermalcorrener: 0.150512 hartree
zpe.thermalcorrenthalpy: 0.151456 hartree
zpe.thermalcorrgfe: 0.069083 hartree
zpe.sumelectzpe: -4778.768056 hartree
zpe.sumelectthermal: -4778.744681 hartree
zpe.sumelectthermalent: -4778.743737 hartree
zpe.sumelectthermalfe: -4778.826110 hartree
dipole: -2.3187 -2.5051 -0.0242
dipole: 3.4135
quadrupole: -211.4505 -201.4276 -197.9375
quadrupole: 8.2683 -0.0928 0.0068
quadrupole: -7.8453 2.1776 5.6677 8.2683 -0.0928 0.0068
hfenergy: -4778.8951923 hartree
pointgroup: C01 [X(C11H3Cl9N4)]
dipole: -0.94305 -0.9561279 0.0096811 debye
polarizability: 382.7682542|-1.019959|265.5647868|-1.5807415|-1.8182118|138.2953816 unknown
InChI: InChI=1S/C11H3Cl9N4/c12-3-1-5(14)6(2-4(3)13)21-9-23-7(10(15,16)17)22-8(24-9)11(18,19)20/h1-2,21H
charge 0 multiplicity 1
27 atoms
Cl -2.671677 -3.683677 0.053469
Cl 5.002558 -1.087692 1.522228
Cl 3.806732 -3.37445 -0.041665
Cl 5.054789 -1.057362 -1.513449
Cl 2.71755 3.315491 -1.584889
Cl 0.119661 3.610654 -0.081694
Cl 2.705131 3.349967 1.449951
Cl -4.228733 2.545816 -0.029121
Cl -6.573583 0.236216 0.026248
N  -0.731927 -1.379214 0.002874
N  0.449308 0.701647 -0.033625
N  1.583143 -1.45447 -0.011773
N  2.863373 0.595087 -0.043536
C  -2.072929 -0.934326 0.006509
C  0.441126 -0.671372 -0.014827
C  1.680838 1.264237 -0.04686
C  2.741589 -0.76913 -0.026887
C  -3.108425 -1.911251 0.029813
C  -2.45255 0.433258 -0.011275
C  4.061544 -1.549916 -0.018271
C  1.778989 2.796583 -0.065378
C  -3.812647 0.789536 -0.005337
C  -4.464591 -1.560026 0.035726
C  -4.823235 -0.195667 0.018085
H  -0.593597 -2.398435 0.015973
H  -1.675025 1.199487 -0.02965
H  -5.237909 -2.331592 0.053761
