program: Gaussian 09
title: 000034959
version: EM64L-G09RevD.01
frameworkgroup: C1[X(C11H5Cl7N4)]
method: RPBEPBE
basis: SDD
operation: Freq
keyword: #p
keyword: freq=noraman
keyword: PBEPBE/SDD
title: #p freq=noraman PBEPBE/SDD
converged: YES YES NO NO
title: Mulliken charges:
elementType: Cl Cl Cl Cl Cl Cl Cl N N N N C C C C C C C C C C C H H H H H
charge: 0.122104 0.137141 0.129373 0.118291 0.134370 0.129479 -0.047290 -0.406410 -0.034383 -0.052465 0.084137 0.493867 0.003109 0.276515 0.320320 -0.260277 -0.467106 -0.788739 -0.785971 -0.101020 -0.176801 -0.263808 0.351288 0.344832 0.236008 0.239827 0.263606
chargesum: 0.00000
title: Mulliken charges with hydrogens summed into heavy atoms:
elementType: Cl Cl Cl Cl Cl Cl Cl N N N N C C C C C C C C C C C
charge: 0.122104 0.137141 0.129373 0.118291 0.134370 0.129479 -0.047290 -0.055122 -0.034383 -0.052465 0.084137 0.493867 0.003109 0.276515 0.320320 0.084555 -0.231098 -0.788739 -0.785971 -0.101020 0.063026 -0.000202
polarizability: 3.30087688e+02 2.43652977e+01 2.42120266e+02 -3.59024803e-01 3.03682327e-01 1.33288902e+02
1716.lowfreq: -5.8954 -5.0519 -3.3864 0.0026 0.0032 0.0033 3.8247 6.1145 21.2170
frequency: 2.5517 5.7627 21.2041 43.5414 45.8021 67.6628 79.1589 107.0549 116.4630 155.1045 169.1088 179.2629 182.8089 188.8412 210.1894 223.4851 251.8486 256.1765 269.0838 283.4240 285.3921 313.7089 335.3612 353.0154 383.8246 388.3573 397.5975 442.2726 451.9827 565.6381 587.3392 607.8646 641.5935 653.8640 666.7897 679.8911 686.0410 705.1717 745.8759 760.4393 769.4490 772.2825 791.6717 802.5764 837.6703 882.9614 889.6812 903.0849 932.1894 970.5811 980.9863 1007.2398 1023.9394 1075.4899 1098.3228 1169.1535 1182.1771 1238.0255 1278.4743 1293.4882 1319.1747 1369.7827 1395.7919 1436.0770 1456.1655 1480.0541 1507.7954 1555.0946 1598.5783 1608.9797 3127.7375 3158.6346 3182.7425 3189.9092 3509.8539
redmass: 33.0263 24.1249 11.9793 8.4453 17.5924 10.7122 24.1932 19.3732 18.9721 30.4432 8.2354 26.0040 5.3550 14.1307 14.4449 22.6480 26.8537 13.9139 7.1605 13.7121 12.9717 12.2899 8.7331 11.5041 15.3817 16.2134 16.8851 3.1438 11.3435 4.7915 7.6128 13.3443 6.3881 11.0226 9.7530 8.0782 2.1024 1.8487 11.5435 3.5372 9.3742 11.6164 1.5331 10.5563 11.0558 6.7577 1.3992 13.4361 1.3839 1.3398 6.0504 9.1091 8.1263 2.0347 1.5996 5.7229 1.0912 2.9620 1.7976 4.5042 4.5583 5.5557 7.0640 3.1691 3.3776 3.4250 3.7833 5.4912 4.1071 6.5923 1.0897 1.0921 1.0977 1.0943 1.0755
irintensity: 0.0041 0.0017 0.6484 0.0089 0.0012 0.1933 0.0673 0.1522 0.2240 1.0324 0.0316 0.3878 0.6337 1.8582 0.3045 0.2368 0.1642 0.9118 1.9756 0.6694 1.2722 0.0809 0.7344 1.5585 3.3200 2.9865 0.5876 6.9500 2.6007 0.2961 32.2368 0.8009 164.4511 96.2677 76.6505 10.8832 33.6175 28.0246 128.2843 104.1881 6.7801 40.2008 141.8087 22.3111 0.4711 109.0140 1.1169 23.3246 25.9556 0.8664 3.6095 24.5519 26.8612 18.1932 0.1902 9.4844 0.6885 4.9099 31.5346 52.3719 5.2803 106.3667 67.7940 15.9661 191.0469 62.5893 560.8759 679.2581 286.7717 19.6180 7.8150 10.2362 2.7603 41.5479 56.3894
temp: 298.150 k
press: 1.00000 atm
elementType: 17 17 17 17 17 17 17 7 7 7 7 6 6 6 6 6 6 6 6 6 6 6 1 1 1 1 1
symmnumber: 1
zpe: 384637.5 jmol-1
zpe.correction: 0.146501 hartree
zpe.thermalcorrener: 0.168187 hartree
zpe.thermalcorrenthalpy: 0.169131 hartree
zpe.thermalcorrgfe: 0.088176 hartree
zpe.sumelectzpe: -3859.997337 hartree
zpe.sumelectthermal: -3859.975651 hartree
zpe.sumelectthermalent: -3859.974707 hartree
zpe.sumelectthermalfe: -3860.055662 hartree
dipole: -3.0646 -4.8114 -0.0417
dipole: 5.7047
quadrupole: -178.1499 -164.4816 -175.1228
quadrupole: 15.6864 -0.2339 0.1962
quadrupole: -5.5652 8.1032 -2.5380 15.6864 -0.2339 0.1962
hfenergy: -3860.1438378 hartree
pointgroup: C01 [X(C11H5Cl7N4)]
dipole: -1.47848 1.6833643 0.1332106 debye
polarizability: 335.2948591|-9.8157348|236.5124045|-4.4863634|5.7963173|133.6895917 unknown
InChI: InChI=1S/C11H5Cl7N4/c12-5-2-1-3-6(4-5)19-9-21-7(10(13,14)15)20-8(22-9)11(16,17)18/h1-4,19H
charge 0 multiplicity 1
27 atoms
Cl 2.056707 -3.396594 1.38338
Cl -0.484755 -3.454182 -0.243582
Cl 2.176123 -3.264021 -1.64646
Cl 4.54084 1.151509 -1.639769
Cl 3.596767 3.289002 0.272588
Cl 4.812555 0.755669 1.357243
Cl -4.865412 -2.082786 0.002704
N  -1.053338 1.561049 0.143272
N  1.263367 1.509403 0.093261
N  0.00829 -0.579145 0.001292
N  2.425459 -0.605022 -0.058122
C  -2.431442 1.204764 0.145315
C  0.07604 0.791919 0.077304
C  2.37979 0.761087 0.025557
C  1.205103 -1.205562 -0.065249
C  -2.887934 -0.137817 0.079994
C  -3.363796 2.27575 0.216343
C  1.215746 -2.73931 -0.144301
C  3.740907 1.468327 0.016481
C  -4.275346 -0.361453 0.087616
C  -4.745563 2.005853 0.221639
C  -5.22414 0.676615 0.156879
H  -0.840747 2.562798 0.195581
H  -2.175212 -0.961539 0.025445
H  -3.009197 3.312263 0.266552
H  -5.459761 2.833418 0.276096
H  -6.295052 0.458302 0.160143
