program: Gaussian 09
title: 000005617
version: EM64L-G09RevD.01
frameworkgroup: C1[X(C21H35N3O)]
method: RPBEPBE
basis: SDD
operation: Freq
keyword: #p
keyword: freq=noraman
keyword: PBEPBE/SDD
title: #p freq=noraman PBEPBE/SDD
converged: YES YES NO NO
title: Mulliken charges:
elementType: O N N N C C C C C C C C C C C C C C C C C C C C C H H H H H H H H H H H H H H H H H H H H H H H H H H H H H H H H H H H
charge: -0.247038 -0.102570 -0.430129 -0.186873 -0.151048 -0.133394 -0.080646 -0.085177 -0.178790 -0.462221 -0.456477 -0.462979 -0.452389 -0.457377 0.184965 -0.058521 -0.413171 -0.436001 -0.350325 -0.387144 -0.403128 -0.407300 -0.380295 -0.318900 -0.308569 0.201826 0.193768 0.189754 0.190522 0.169773 0.191042 0.195022 0.184066 0.223728 0.188141 0.194076 0.220927 0.182521 0.190754 0.192388 0.301644 0.226604 0.191748 0.218921 0.193707 0.214491 0.217979 0.239098 0.234294 0.226485 0.194907 0.205303 0.208009 0.186027 0.192231 0.203438 0.186519 0.216368 0.214474 0.184943
chargesum: 0.00000
title: Mulliken charges with hydrogens summed into heavy atoms:
elementType: O N N N C C C C C C C C C C C C C C C C C C C C C
charge: -0.247038 -0.102570 -0.128485 -0.186873 0.050777 0.060374 0.109107 0.105345 -0.009017 -0.076157 -0.048684 -0.080762 -0.048940 -0.074235 0.184965 0.168082 -0.002502 -0.027803 0.106752 0.073635 -0.002917 -0.013263 0.015374 0.083987 0.090847
polarizability: 2.75976244e+02 6.89924984e-01 2.44562680e+02 6.51742529e+00 -4.02162075e+00 2.00479245e+02
1716.lowfreq: -42.9151 -22.1713 -11.3007 0.0003 0.0005 0.0006 3.4349 17.2194 33.6529
frequency: -42.1892 14.5210 33.3969 38.8526 49.8056 72.1494 85.9016 109.5422 142.6326 162.3197 189.6365 206.2822 235.5526 257.4983 276.6042 290.9750 297.2763 302.6632 339.7050 360.2786 368.3480 380.6680 395.5943 403.9534 413.4795 419.0156 438.0217 449.3081 456.7988 464.2119 474.8085 525.9932 552.0276 580.9616 603.7085 627.6166 628.5416 647.3827 684.2343 700.2765 739.2020 763.7645 767.4543 791.5327 792.7803 802.2696 807.7250 818.2691 834.8927 838.7591 857.3664 862.7592 867.3059 868.2014 894.2789 907.5188 914.7043 919.1500 930.4028 952.9802 961.2310 977.7383 998.8418 1005.6256 1013.7881 1024.8833 1036.2776 1040.1359 1043.6171 1047.2225 1049.2816 1052.1813 1066.2795 1077.7052 1080.3638 1086.0425 1097.2282 1098.2171 1102.1605 1110.2063 1110.7592 1112.6930 1114.3766 1119.9547 1146.4347 1153.6824 1172.9004 1176.0396 1185.5737 1212.5353 1231.0332 1245.5565 1246.7270 1252.8064 1256.6261 1262.0207 1269.4515 1279.1078 1282.8933 1292.2328 1292.9627 1298.1562 1300.8563 1309.9510 1314.9962 1322.4627 1323.2031 1326.5594 1327.3543 1332.6153 1334.2232 1341.5920 1342.4687 1344.4217 1349.6831 1351.2895 1353.9016 1356.6088 1360.4558 1362.2704 1366.6269 1368.4249 1384.5157 1438.6877 1442.8732 1443.9474 1449.5463 1450.1948 1452.5604 1455.2617 1456.0575 1458.7253 1462.1240 1465.6488 1468.3106 1470.6160 1474.5342 1483.5816 1600.0148 2833.3134 2922.9975 2941.7567 2944.1669 2947.2974 2955.0924 2955.7838 2956.7502 2960.4893 2960.7334 2962.7163 2966.5354 2968.6105 2968.9108 2974.3509 2978.3138 2990.1816 2993.3477 3004.2142 3009.0296 3016.4210 3018.2431 3027.2673 3029.0424 3033.5788 3037.4910 3038.1020 3041.9408 3045.5627 3046.3893 3075.6034 3078.1044 3079.1278 3083.0936 3538.5517
redmass: 3.2421 3.4236 4.3202 4.2974 4.1928 2.9798 4.0994 3.2298 3.6065 3.5336 4.4869 2.8106 2.4058 2.4825 2.1494 2.5483 2.3730 2.1654 2.3119 2.4884 2.5771 2.0867 2.9766 2.3648 1.8512 1.7074 2.8842 3.2039 2.7536 2.4074 2.9363 2.5451 1.8592 2.6830 2.9268 3.6971 3.9075 3.0975 3.8043 5.2109 3.8528 3.8270 1.5282 3.4712 3.2284 3.4831 2.7578 2.5325 1.6850 1.6734 2.4121 1.6191 1.7219 2.0685 2.2849 2.1703 2.0755 1.4229 2.2871 2.4649 2.2020 2.1499 2.3367 3.1673 3.3464 2.1979 2.4359 2.2492 1.4883 1.8398 1.8570 2.0057 1.5518 3.7061 1.7338 1.7028 1.5008 1.6639 2.0803 1.0735 1.0649 1.0270 1.1484 1.7975 2.0286 2.1796 2.8570 1.2703 1.0656 1.0400 1.4102 1.5897 1.5142 1.5085 1.2939 1.5535 1.3361 1.2682 1.7819 1.8822 1.5755 2.0226 2.1175 1.3779 1.4697 1.3248 1.2813 1.3399 1.3481 1.4130 1.4375 1.4226 1.2750 1.4633 1.4881 1.4208 1.5125 1.5068 1.4206 1.5652 1.4113 1.4323 2.6729 1.3705 1.0860 1.0886 1.0995 1.0863 1.0859 1.0866 1.0831 1.0913 1.0917 1.0850 1.0933 1.0927 1.0910 1.1082 5.1673 1.0795 1.0712 1.0676 1.0701 1.0677 1.0622 1.0663 1.0612 1.0667 1.0701 1.0666 1.0597 1.0667 1.0621 1.0721 1.0618 1.0830 1.0840 1.0859 1.1020 1.1009 1.1013 1.0948 1.0925 1.0991 1.0992 1.0900 1.0991 1.1026 1.0984 1.0927 1.0923 1.0929 1.0969 1.0742
irintensity: 0.2481 0.1251 0.0677 0.1018 0.1460 0.1035 0.3929 0.2677 0.1785 1.1555 0.5223 1.2899 6.4116 8.8987 0.1571 9.2460 2.5741 0.7281 1.3581 2.2260 0.2714 1.6188 3.0436 0.1660 0.1046 0.7975 4.0327 3.0465 1.7589 3.0072 0.1956 39.1407 43.2551 3.0046 14.5955 0.1619 1.0185 8.2054 3.6636 10.1841 0.5097 0.6711 0.3159 16.2816 4.7280 2.6362 2.6000 1.0591 0.2874 3.6710 8.4812 0.0970 0.3666 1.8773 8.4838 8.2515 0.0950 11.6383 25.8485 21.4687 31.4219 7.8829 16.5912 1.2585 3.3940 11.3053 4.7858 11.3039 0.0925 0.3416 6.2080 23.9439 3.2253 50.1671 2.3487 0.7296 5.0639 24.2151 2.7262 0.1365 2.4835 0.5729 1.1107 9.4947 24.8124 20.8357 8.5121 0.6810 1.3464 6.5735 51.7745 4.7323 29.1090 85.1273 3.0049 4.2529 21.4106 23.7726 0.0956 1.8863 0.2606 0.2191 1.0086 1.6826 3.4073 2.9180 0.8244 1.3646 0.4185 2.1000 8.0916 1.3891 7.9361 3.6203 8.9769 11.8049 26.0414 3.9540 6.4990 1.1825 17.7722 9.2104 187.4836 12.2198 4.7205 3.6762 18.1618 8.8852 1.7964 10.9028 5.9971 18.4331 19.1276 7.7427 9.2120 23.4994 12.2733 4.1712 591.2175 85.0821 47.3393 65.4298 24.5808 16.6912 22.7413 106.4031 27.9191 21.1530 60.9736 21.2073 46.8103 3.0918 29.2140 129.9536 30.0318 153.9356 148.8588 34.0972 9.2356 78.2283 86.0252 83.7670 85.7948 3.8354 9.4198 38.6860 14.4337 128.0674 46.7429 18.4645 59.6170 8.5730 37.8529 4.8037
temp: 298.150 k
press: 1.00000 atm
elementType: 8 7 7 7 6 6 6 6 6 6 6 6 6 6 6 6 6 6 6 6 6 6 6 6 6 1 1 1 1 1 1 1 1 1 1 1 1 1 1 1 1 1 1 1 1 1 1 1 1 1 1 1 1 1 1 1 1 1 1 1
symmnumber: 1
zpe: 1407560.2 jmol-1
zpe.correction: 0.536111 hartree
zpe.thermalcorrener: 0.557689 hartree
zpe.thermalcorrenthalpy: 0.558633 hartree
zpe.thermalcorrgfe: 0.485171 hartree
zpe.sumelectzpe: -1058.734455 hartree
zpe.sumelectthermal: -1058.712877 hartree
zpe.sumelectthermalent: -1058.711933 hartree
zpe.sumelectthermalfe: -1058.785396 hartree
dipole: -0.5197 3.5297 -0.1138
dipole: 3.5695
quadrupole: -155.8608 -157.1871 -150.5231
quadrupole: -10.1215 0.5395 -2.1695
quadrupole: -1.3371 -2.6635 4.0006 -10.1215 0.5395 -2.1695
hfenergy: -1059.2705662 hartree
pointgroup: C01 [X(C21H35N3O1)]
dipole: 0.2509777 -1.3600508 -0.2439363 debye
polarizability: 274.9586973|3.4237538|242.880272|-10.2848182|9.3293581|203.1792 unknown
InChI: InChI=1S/C21H35N3O/c1-2-4-19(5-3-1)22-21(24-6-8-25-9-7-24)23-20-17-11-15-10-16(13-17)14-18(20)12-15/h15-20,22H,1-14H2
charge 0 multiplicity 1
60 atoms
O  4.020023 3.464821 0.264929
N  -0.276791 0.865754 0.284654
N  1.261928 -0.691133 -0.792153
N  2.008991 1.402855 0.049332
C  -2.355177 0.187489 1.466532
C  -2.208604 -0.032803 -1.057106
C  -4.282402 -0.839025 0.167226
C  -3.800161 1.648287 -0.021886
C  -1.389374 -0.102101 0.277439
C  -3.471869 -0.891223 1.491295
C  -2.988917 1.593795 1.301319
C  -3.325278 -1.111508 -1.025799
C  -2.843591 1.374546 -1.214856
C  -4.918365 0.569555 0.005775
C  0.918564 0.51594 -0.14007
C  2.464816 -1.498672 -0.442794
C  2.334598 -2.198256 0.942366
C  2.736737 -2.54188 -1.556685
C  1.786648 2.573153 0.927761
C  2.873616 1.74577 -1.109996
C  1.303424 -3.351557 0.934983
C  1.70346 -3.697388 -1.563818
C  1.617346 -4.381076 -0.177594
C  3.147029 3.109339 1.401176
C  4.218139 2.290675 -0.600644
H  -1.770276 0.151646 2.406553
H  -1.527081 -0.22516 -1.912627
H  -5.079133 -1.609262 0.187568
H  -4.256095 2.651895 -0.13712
H  -1.02388 -1.156321 0.390522
H  -3.02955 -1.900105 1.625996
H  -4.143937 -0.712561 2.354682
H  -3.651101 1.810011 2.164361
H  -2.18672 2.354205 1.286907
H  -2.881814 -2.12468 -0.930243
H  -3.890706 -1.091271 -1.97944
H  -2.045492 2.139459 -1.243477
H  -3.401102 1.426751 -2.172337
H  -5.51195 0.611913 -0.930221
H  -5.615175 0.767424 0.845539
H  0.457992 -1.236275 -1.11001
H  3.319904 -0.802397 -0.38837
H  3.330217 -2.603792 1.21857
H  2.070818 -1.44062 1.704922
H  3.743635 -2.972751 -1.38529
H  2.760001 -2.033376 -2.539454
H  1.22917 3.369585 0.388249
H  1.162623 2.262313 1.781822
H  3.023617 0.856262 -1.743372
H  2.378958 2.526232 -1.732322
H  0.284579 -2.939465 0.777647
H  1.288441 -3.847163 1.924491
H  1.980971 -4.435818 -2.340182
H  0.699493 -3.317864 -1.849801
H  2.588509 -4.871098 0.043408
H  0.850804 -5.179713 -0.190487
H  3.652445 2.344052 2.029978
H  3.026627 4.041971 1.976733
H  4.847093 2.643947 -1.434772
H  4.754923 1.495171 -0.037204
