program: Gaussian 09
title: 000005497
version: EM64L-G09RevD.01
frameworkgroup: C1[X(C10H14N2O)]
method: RPBEPBE
basis: SDD
operation: Freq
keyword: #p
keyword: freq=noraman
keyword: PBEPBE/SDD
title: #p freq=noraman PBEPBE/SDD
converged: YES YES NO NO
title: Mulliken charges:
elementType: O N N C C C C C C C C C C H H H H H H H H H H H H H H
charge: -0.276925 -0.135031 -0.003294 -0.332451 -0.376126 0.131819 -0.663625 -0.645000 0.280107 -0.294549 -0.463156 -0.181156 -0.331272 0.260252 0.201288 0.251465 0.219873 0.208045 0.252480 0.216952 0.216016 0.227095 0.222227 0.271203 0.264284 0.234179 0.245300
chargesum: 0.00000
title: Mulliken charges with hydrogens summed into heavy atoms:
elementType: O N N C C C C C C C C C C
charge: -0.276925 -0.135031 -0.003294 0.129089 0.095212 0.131819 0.013852 0.020338 0.280107 -0.023346 -0.198872 0.053024 -0.085972
polarizability: 1.63304255e+02 -3.21893389e+00 9.73268498e+01 3.58783732e+00 1.03234690e+01 1.06767445e+02
1716.lowfreq: -25.0590 -9.8807 0.0004 0.0006 0.0008 2.5111 9.7581 41.6014 54.4617
frequency: -22.0015 41.5593 54.3960 70.2514 104.4035 130.1174 204.4231 215.2030 227.9115 279.9110 302.3843 332.4269 365.2692 392.0846 421.6003 509.3286 546.5301 602.5998 624.1739 701.2677 713.2904 725.7305 772.0415 780.5607 825.8610 859.4613 929.8324 939.8515 950.8657 991.3499 993.1203 1009.3843 1025.8323 1065.9948 1080.6327 1092.3841 1096.1827 1111.1672 1186.6830 1202.5986 1214.7655 1274.8449 1300.9188 1305.8015 1329.8842 1342.4821 1356.4749 1382.3272 1388.3756 1401.3391 1408.6001 1452.5030 1458.5827 1466.2729 1469.7881 1475.5363 1482.6951 1484.6251 1540.4213 1557.6459 1580.4321 2985.3510 2985.4878 3000.1249 3014.6494 3068.9355 3076.5965 3083.6738 3086.7660 3101.7052 3104.5688 3121.7767 3134.3966 3151.7416 3171.9462
redmass: 2.5469 3.1677 3.9159 4.0363 3.8388 2.8969 3.2245 1.2182 1.2296 2.9596 2.7017 3.3986 3.4080 2.9787 3.0293 3.4511 4.2015 6.3541 5.2094 6.2656 5.9478 1.8442 1.2365 1.2011 1.8527 2.5627 1.3360 2.0498 1.4762 1.4776 3.0659 3.4504 3.1821 2.0944 1.8908 1.9822 1.8275 1.6506 1.8417 1.9926 1.9768 1.4717 1.3976 8.9094 1.2776 1.2289 1.2864 1.2179 1.2120 2.0056 2.3063 1.1786 1.9879 1.0491 1.0430 1.1392 1.0834 1.0702 5.3938 5.8955 5.9215 1.0355 1.0354 1.0682 1.0601 1.1017 1.0977 1.0998 1.0984 1.1015 1.0994 1.0910 1.0889 1.0917 1.1002
irintensity: 0.4204 1.3266 0.8891 4.6031 3.3888 0.2820 1.5347 0.6011 2.5877 1.0082 2.5970 1.2535 11.6748 4.0992 1.1420 5.5028 2.5135 4.3320 4.9808 5.2367 8.8731 40.3526 8.8585 7.7178 33.9318 19.0012 3.8296 6.0545 2.2764 0.5167 6.2665 6.0784 1.5821 21.1228 3.8774 42.5665 15.0589 14.5045 5.8783 12.8182 7.2044 89.8115 37.6577 1.2066 3.3012 7.0037 7.6420 16.3091 23.2527 29.1266 113.2023 33.7686 3.0817 6.6625 14.1657 8.0423 3.1300 17.1605 68.7372 163.5189 20.2581 23.4080 24.6090 31.0177 35.6730 5.0187 7.2758 41.1183 33.9488 18.9119 53.6570 18.2652 6.5960 12.1358 19.0202
temp: 298.150 k
press: 1.00000 atm
elementType: 8 7 7 6 6 6 6 6 6 6 6 6 6 1 1 1 1 1 1 1 1 1 1 1 1 1 1
symmnumber: 1
zpe: 587609.9 jmol-1
zpe.correction: 0.223809 hartree
zpe.thermalcorrener: 0.236272 hartree
zpe.thermalcorrenthalpy: 0.237217 hartree
zpe.thermalcorrgfe: 0.184232 hartree
zpe.sumelectzpe: -573.207200 hartree
zpe.sumelectthermal: -573.194736 hartree
zpe.sumelectthermalent: -573.193792 hartree
zpe.sumelectthermalfe: -573.246776 hartree
dipole: 1.4246 3.1928 -0.9119
dipole: 3.6131
quadrupole: -67.4510 -83.9175 -80.3834
quadrupole: 4.1183 9.4642 -2.9280
quadrupole: 9.7997 -6.6669 -3.1328 4.1183 9.4642 -2.9280
hfenergy: -573.4310086 hartree
pointgroup: C01 [X(C10H14N2O1)]
dipole: 0.4993109 1.3216958 0.1565869 debye
polarizability: 163.4018875|-1.3077061|91.2080026|3.3145466|4.1199503|112.7886593 unknown
InChI: InChI=1S/C10H14N2O/c1-3-12(4-2)10(13)9-6-5-7-11-8-9/h5-8H,3-4H2,1-2H3
charge 0 multiplicity 1
27 atoms
O  0.948059 -1.22748 -1.545532
N  1.630277 0.300691 0.076175
N  -2.607922 -0.294344 1.406832
C  3.047482 -0.042346 -0.21971
C  1.388782 1.490804 0.928651
C  0.651022 -0.396814 -0.621692
C  3.546541 -1.220328 0.642615
C  1.597661 2.821778 0.170904
C  -0.800215 -0.195237 -0.254612
C  -1.751892 0.003686 -1.286328
C  -1.286769 -0.359933 1.069545
C  -3.120112 0.086258 -0.954339
C  -3.501483 -0.057886 0.4008
H  3.119976 -0.30879 -1.288318
H  3.661698 0.858629 -0.042401
H  0.362038 1.456896 1.322647
H  2.072234 1.436144 1.797727
H  3.469563 -0.992251 1.721399
H  2.95173 -2.124798 0.430159
H  4.604826 -1.44211 0.411941
H  2.617331 2.89795 -0.247286
H  0.877751 2.912657 -0.661626
H  1.445869 3.676244 0.855654
H  -1.41075 0.07153 -2.324264
H  -0.599321 -0.583126 1.894624
H  -3.880169 0.247913 -1.724981
H  -4.553609 0.004064 0.701218
