program: Gaussian 09
title: 000005598
version: EM64L-G09RevD.01
frameworkgroup: C1[X(C21H25N3O2)]
method: RPBEPBE
basis: SDD
operation: Freq
keyword: #p
keyword: freq=noraman
keyword: PBEPBE/SDD
title: #p freq=noraman PBEPBE/SDD
converged: YES YES NO NO
title: Mulliken charges:
elementType: O O N N N C C C C C C C C C C C C C C C C C C C C C H H H H H H H H H H H H H H H H H H H H H H H H H
charge: -0.275973 -0.258820 -0.162021 -0.355621 -0.470712 -0.137622 -0.450568 -0.342544 -0.468522 -0.216479 0.144498 0.130211 -0.582648 0.206627 0.234133 0.122186 0.195649 -0.590598 -0.413648 -0.363698 -0.321754 -0.265131 -0.224250 0.358776 -0.781738 -0.791566 0.257472 0.239841 0.248147 0.247056 0.243801 0.222250 0.239115 0.267583 0.242687 0.226644 0.350876 0.314354 0.224753 0.241395 0.246728 0.229897 0.240891 0.225283 0.221229 0.216427 0.231606 0.222807 0.230154 0.231339 0.219495
chargesum: 0.00000
title: Mulliken charges with hydrogens summed into heavy atoms:
elementType: O O N N N C C C C C C C C C C C C C C C C C C C C C
charge: -0.275973 -0.258820 -0.162021 -0.004745 -0.156358 0.119849 0.037420 0.148313 -0.007157 0.051104 0.144498 0.130211 -0.113317 0.206627 0.234133 0.122186 0.195649 -0.124450 -0.166920 -0.133800 -0.080862 -0.039848 -0.003021 0.358776 -0.110899 -0.110577
polarizability: 3.25128272e+02 2.39800069e+01 2.90454044e+02 -1.13254631e+01 9.73938480e+00 1.53620761e+02
1716.lowfreq: -6.9739 -2.8793 -0.0007 -0.0005 -0.0004 4.6198 10.8989 22.6396 24.2380
frequency: 8.8297 22.4458 24.2157 26.9732 37.5724 58.8234 63.7680 75.0007 92.8316 122.6167 126.1119 131.6132 158.5269 173.5320 181.7160 199.5064 210.9728 244.7104 247.1026 271.5589 298.8492 305.3468 329.8921 348.7628 389.5311 410.0854 430.0093 432.8052 442.0410 442.5712 479.3002 485.5662 520.1430 548.2191 560.8470 567.6076 576.9723 585.3776 609.2440 615.8847 648.6475 674.7726 686.2252 694.7000 725.5268 750.6388 756.2352 762.7410 772.0298 783.0410 832.6265 846.1283 851.8858 867.8888 868.9387 888.6042 901.3737 913.7574 928.1486 930.7975 934.4848 947.6233 971.3054 994.0875 995.4099 1007.5679 1015.2070 1018.9732 1033.0033 1064.6021 1081.9585 1094.9904 1106.9428 1116.0852 1120.4034 1134.1309 1150.8038 1163.5794 1174.4729 1175.7943 1192.3424 1196.8498 1216.4798 1218.3343 1237.1528 1240.8524 1247.0857 1267.0103 1272.8778 1286.5007 1297.9629 1309.0126 1312.3552 1317.1897 1320.4051 1336.0743 1346.2242 1354.6122 1382.4752 1389.0754 1399.7137 1400.8457 1405.9969 1428.7071 1434.1015 1454.7532 1455.0654 1459.8797 1464.2052 1469.3942 1470.2595 1471.8963 1477.1717 1479.2475 1480.5078 1494.0503 1567.9479 1584.4723 1602.8168 1626.5813 1630.1598 1688.3030 2923.7990 2961.3751 2967.9568 2976.5733 2982.4972 3002.9114 3012.5289 3023.4879 3030.2768 3033.5242 3036.1942 3037.4992 3052.4780 3058.2569 3081.1553 3087.7166 3088.3346 3094.8139 3112.2950 3124.4023 3132.8916 3145.9564 3163.6091 3505.2422 3582.5223
redmass: 4.1783 4.4613 4.4108 3.6728 5.3222 3.7831 3.6441 4.8393 3.9955 2.0536 1.9435 2.6731 2.1653 1.7214 2.2476 2.9939 3.2343 3.1649 4.3249 3.7429 2.3380 3.6903 7.2749 3.8186 2.3948 3.5121 4.2201 2.9641 6.0376 2.9403 4.3089 3.4150 3.3085 3.2517 3.9799 3.4395 2.1236 1.5810 2.2185 4.2131 4.4217 5.3551 1.9667 2.8244 3.8891 1.3631 4.0041 3.4499 2.5003 3.8115 2.2816 1.9432 1.4882 3.3713 1.9722 1.8247 2.7162 3.0433 2.2314 1.3920 2.4906 1.3829 1.2988 1.3545 1.9594 2.3740 2.3812 2.1273 2.9995 2.0153 1.6712 2.8774 2.7195 2.0495 2.3622 1.7668 1.8929 1.2198 1.4237 1.5200 1.5563 1.4198 1.7373 1.3653 1.3856 1.5217 1.8658 1.2579 1.3479 1.8801 1.4823 1.5357 1.3536 1.6011 1.8555 1.5654 2.0049 1.4476 1.9815 1.2861 1.2625 3.8150 5.1997 2.5843 2.7543 1.2238 1.0513 1.1184 2.8475 1.1097 1.0866 1.0537 1.0914 1.1276 2.8344 1.0863 7.5643 6.2699 9.7148 6.4274 6.9541 6.3638 1.0821 1.0374 1.0389 1.0600 1.0622 1.0593 1.0671 1.0986 1.0642 1.0970 1.0872 1.0964 1.0978 1.1025 1.0969 1.0913 1.1012 1.0962 1.1032 1.0851 1.0887 1.0951 1.1000 1.0764 1.0801
irintensity: 0.3512 0.3714 1.5874 0.0193 0.9486 0.0182 0.1031 0.8879 0.9970 1.1870 2.0126 1.1295 2.5477 0.8655 2.4523 0.7540 3.5552 5.1656 0.9938 1.6637 2.4501 1.2362 24.6695 4.2665 1.8362 6.2927 9.2279 10.1230 0.7133 4.0795 2.0707 0.8003 2.9264 6.0229 8.7640 0.4236 28.9470 40.3574 13.5812 7.8995 8.2511 6.5799 132.5748 45.8543 14.4060 78.3514 4.0784 12.9946 4.0487 9.2467 4.4283 3.0073 1.0083 4.6167 6.8960 1.8935 3.4007 18.7208 3.9573 1.7260 1.5145 0.9738 0.1736 2.9206 11.1055 17.9741 2.3701 7.6579 6.8042 4.5478 4.1854 9.2576 18.1982 22.8697 0.1798 2.6349 9.9705 4.3368 6.3557 8.1850 16.4104 21.3666 38.1413 0.5895 24.4727 43.9679 4.9717 10.7412 2.4999 11.9564 32.2009 13.9317 1.7153 32.2825 7.6085 4.1186 23.0287 2.6459 44.2654 26.6476 29.0446 190.0960 43.2735 16.0274 14.0259 14.3374 2.0655 14.0689 29.1466 11.3680 11.1644 22.0188 6.9359 4.7959 10.4541 3.4984 9.0924 2.2277 266.0087 319.4795 22.8874 7.3918 25.4369 35.3270 50.1814 20.2060 24.9617 22.2403 36.7902 12.3034 13.5378 4.8427 4.7167 39.4433 21.0905 20.7002 8.6943 33.9908 35.5093 40.9255 24.7700 1.5091 3.5098 36.1237 28.2687 26.5772 72.3435
temp: 298.150 k
press: 1.00000 atm
elementType: 8 8 7 7 7 6 6 6 6 6 6 6 6 6 6 6 6 6 6 6 6 6 6 6 6 6 1 1 1 1 1 1 1 1 1 1 1 1 1 1 1 1 1 1 1 1 1 1 1 1 1
symmnumber: 1
zpe: 1107436.1 jmol-1
zpe.correction: 0.421800 hartree
zpe.thermalcorrener: 0.446424 hartree
zpe.thermalcorrenthalpy: 0.447368 hartree
zpe.thermalcorrgfe: 0.363549 hartree
zpe.sumelectzpe: -1128.070118 hartree
zpe.sumelectthermal: -1128.045494 hartree
zpe.sumelectthermalent: -1128.044550 hartree
zpe.sumelectthermalfe: -1128.128368 hartree
dipole: -2.6796 -1.6258 -1.3144
dipole: 3.3987
quadrupole: -116.3548 -170.2270 -154.5422
quadrupole: -6.0464 -9.9930 -0.3345
quadrupole: 30.6865 -23.1856 -7.5009 -6.0464 -9.9930 -0.3345
hfenergy: -1128.4919178 hartree
pointgroup: C01[X(C21H25N3O2)]
dipole: 0.970806 -0.7854522 0.4780606 debye
polarizability: 311.690438|-30.936572|298.593675|-26.3246059|-14.1976492|158.9189648 unknown
InChI: InChI=1S/C21H25N3O2/c1-13(2)9-10-17-15(14-6-3-4-7-16(14)22-17)12-18-21(26)24-11-5-8-19(24)20(25)23-18/h3-4,6-7,9,18-19,22-23H,5,8,10-12H2,1-2H3
charge 0 multiplicity 1
51 atoms
O  -2.50398 -2.717278 0.213337
O  -3.40254 2.546387 -0.950857
N  -3.802033 -0.807881 0.502366
N  -1.956826 0.719142 -0.884239
N  3.056747 0.310573 -0.274761
C  -3.985587 0.666133 0.505115
C  -5.507372 0.82271 0.281151
C  -5.06022 -1.530228 0.830287
C  -6.087456 -0.388135 1.059937
C  -1.48152 -0.553974 -0.301187
C  -2.643092 -1.453572 0.159301
C  -3.101145 1.394158 -0.515059
C  -0.449882 -0.342018 0.863031
C  0.875896 0.204792 0.39503
C  2.029794 -0.55181 0.14214
C  1.211477 1.595025 0.11765
C  2.589507 1.627414 -0.305918
C  2.302525 -2.03279 0.306637
C  0.4916 2.819942 0.187682
C  3.247781 2.824794 -0.659655
C  3.249461 -2.581744 -0.749456
C  1.144726 4.018474 -0.161037
C  2.507132 4.022414 -0.582319
C  4.493915 -3.1119 -0.559243
C  5.29663 -3.644007 -1.736926
C  5.182074 -3.252826 0.788014
H  -3.724391 1.078247 1.505869
H  -5.730473 0.748384 -0.797926
H  -5.878096 1.795291 0.63851
H  -4.92033 -2.176395 1.714525
H  -5.332436 -2.185568 -0.017898
H  -6.154409 -0.148678 2.137183
H  -7.09594 -0.668292 0.71433
H  -0.969929 -1.123303 -1.097679
H  -0.312247 -1.325042 1.349886
H  -0.905977 0.330623 1.615724
H  -1.315793 1.227546 -1.502459
H  3.977741 -0.016879 -0.563938
H  2.700627 -2.226126 1.322136
H  1.338434 -2.573916 0.251301
H  -0.556774 2.840816 0.505395
H  4.295485 2.830626 -0.981011
H  2.861804 -2.539968 -1.778728
H  0.596499 4.965684 -0.113126
H  2.985051 4.971505 -0.849469
H  6.269239 -3.120664 -1.827501
H  4.753446 -3.531994 -2.691023
H  5.529715 -4.718579 -1.599779
H  5.319539 -4.322849 1.040879
H  4.627881 -2.780015 1.614725
H  6.194926 -2.805349 0.756248
