program: Gaussian 09
title: 000034969
version: EM64L-G09RevD.01
frameworkgroup: C1[X(C12H8Cl6N4O)]
method: RPBEPBE
basis: SDD
operation: Freq
keyword: #p
keyword: freq=noraman
keyword: PBEPBE/SDD
title: #p freq=noraman PBEPBE/SDD
converged: YES YES NO NO
title: Mulliken charges:
elementType: Cl Cl Cl Cl Cl Cl O N N N N C C C C C C C C C C C C H H H H H H H H
charge: 0.116330 0.121881 0.126207 0.119125 0.131921 0.115042 -0.321584 -0.381810 -0.028330 -0.050513 0.075651 0.289833 0.171480 -0.014226 -0.294965 0.277328 0.320207 -0.321454 -0.242820 -0.239177 -0.784756 -0.785156 -0.525160 0.383667 0.321260 0.245115 0.233698 0.231222 0.230106 0.229910 0.249967
chargesum: 0.00000
title: Mulliken charges with hydrogens summed into heavy atoms:
elementType: Cl Cl Cl Cl Cl Cl O N N N N C C C C C C C C C C C C
charge: 0.116330 0.121881 0.126207 0.119125 0.131921 0.115042 -0.321584 0.001857 -0.028330 -0.050513 0.075651 0.289833 0.171480 -0.014226 0.026295 0.277328 0.320207 -0.076339 -0.009122 -0.007955 -0.784756 -0.785156 0.184823
polarizability: 3.56185457e+02 1.57281958e+00 2.41297099e+02 3.42115929e-01 -3.96050182e-01 1.41602886e+02
1716.lowfreq: -9.6028 -1.0782 -0.0007 0.0015 0.0016 3.7486 6.3852 12.6262 24.9282
frequency: -7.5142 12.3838 24.9121 43.9705 53.1113 68.6894 75.8969 94.3657 110.5983 135.2052 151.2917 153.9287 163.9565 180.3109 202.7024 212.2432 223.3523 232.0229 246.6411 252.0231 278.7091 279.4365 302.4888 304.0495 328.3131 343.7220 380.9369 393.0216 436.0304 462.0667 482.8841 552.8798 555.6408 590.4946 606.7173 645.1293 655.2657 667.1573 731.1929 740.2663 742.4386 751.4779 758.1696 768.4474 773.0509 803.6924 824.5048 844.7089 845.3583 861.2207 899.5822 948.0477 993.3557 994.3688 1004.2181 1022.4812 1043.1381 1108.4820 1118.0130 1149.7639 1173.0087 1176.4789 1204.8240 1253.8551 1282.0638 1302.2160 1326.1507 1366.8823 1404.4311 1434.0018 1452.4275 1464.8288 1467.6378 1469.8814 1489.2586 1505.0272 1574.1736 1608.4086 1610.6082 2972.2755 3065.4371 3134.0153 3140.9311 3159.2883 3173.6952 3192.8627 3460.0769
redmass: 27.0978 26.5416 4.9604 8.9351 8.1102 9.4949 21.7092 3.4407 19.1515 6.3202 4.8223 18.2927 11.9377 30.7449 1.9835 9.0219 11.8161 7.6447 2.3891 26.9996 5.2904 17.2267 10.0394 13.2122 5.4161 13.8520 24.1801 20.0821 11.2796 3.3636 6.5161 5.6855 3.7990 7.2137 13.4227 10.6443 10.5006 9.6947 4.1555 6.2390 8.7753 6.7603 1.2865 11.8908 9.3218 9.9139 2.4303 2.2762 5.6508 1.3957 13.6258 1.3451 8.5594 1.3054 9.3486 9.4597 2.0919 2.2464 1.2548 1.4618 3.4509 1.0763 2.8014 2.6988 3.5774 2.8987 4.4047 5.0705 6.7732 1.3667 2.1731 3.6241 1.0498 1.2262 1.8784 4.2315 6.3890 6.9196 5.0127 1.0322 1.1048 1.1004 1.0863 1.0916 1.0972 1.0960 1.0752
irintensity: 0.0040 0.0097 0.1492 0.3010 0.3665 1.4388 0.0700 5.3220 0.4883 0.2964 0.1926 0.4496 2.5630 0.0393 0.9390 0.2744 0.2682 1.5798 1.5185 0.1082 2.1983 0.1649 1.2433 1.6717 0.2218 1.7216 0.7440 0.9107 1.3728 5.9547 5.0292 14.7287 0.1337 40.5985 0.7793 171.4355 106.3349 48.3866 50.1342 59.0231 104.0515 12.9461 97.5878 2.8477 44.1133 37.5056 90.0340 41.8190 20.3692 1.1058 46.9694 5.7692 61.6125 1.9756 57.7482 47.9161 8.0753 30.7314 0.1297 0.2137 4.6126 12.7624 62.3680 116.8546 38.9619 15.4732 6.5027 128.7215 128.6950 7.8851 38.9124 170.6194 15.2811 84.8646 28.1345 436.7512 822.8023 31.8074 131.7664 70.7631 37.8467 14.5370 1.1933 16.6396 15.1104 20.5303 147.0020
temp: 298.150 k
press: 1.00000 atm
elementType: 17 17 17 17 17 17 8 7 7 7 7 6 6 6 6 6 6 6 6 6 6 6 6 1 1 1 1 1 1 1 1
symmnumber: 1
zpe: 493419.4 jmol-1
zpe.correction: 0.187934 hartree
zpe.thermalcorrener: 0.210044 hartree
zpe.thermalcorrenthalpy: 0.210988 hartree
zpe.thermalcorrgfe: 0.133426 hartree
zpe.sumelectzpe: -3514.964231 hartree
zpe.sumelectthermal: -3514.942121 hartree
zpe.sumelectthermalent: -3514.941177 hartree
zpe.sumelectthermalfe: -3515.018739 hartree
dipole: 7.7712 -2.1633 -0.0347
dipole: 8.0668
quadrupole: -146.2059 -170.4637 -175.2180
quadrupole: -13.3220 0.4420 -0.2802
quadrupole: 17.7566 -6.5012 -11.2555 -13.3220 0.4420 -0.2802
hfenergy: -3515.1521649 hartree
pointgroup: C01 [X(C12H8Cl6N4O1)]
dipole: -2.9856476 -1.0123582 0.3653879 debye
polarizability: 355.3548323|4.4104657|237.8590468|-11.2346482|-19.0447856|145.8715635 unknown
InChI: InChI=1S/C12H8Cl6N4O/c1-23-7-5-3-2-4-6(7)19-10-21-8(11(13,14)15)20-9(22-10)12(16,17)18/h2-5,19H,1H3
charge 0 multiplicity 1
31 atoms
Cl 2.898543 2.867811 -2.314464
Cl 0.63607 3.946261 -0.632403
Cl 3.328719 3.464017 0.628702
Cl 4.77254 -1.159532 1.549201
Cl 3.053182 -3.467482 0.653586
Cl 4.5167 -1.814502 -1.402773
O  -3.151087 -2.256678 0.647502
N  -1.077274 -0.736738 0.266433
N  1.189103 -1.229214 0.254223
N  0.442246 1.057356 -0.16423
N  2.80197 0.520703 -0.179205
C  -2.327383 -0.070327 0.192679
C  -3.468596 -0.908528 0.402749
C  0.192417 -0.270502 0.112316
C  -2.514238 1.307704 -0.063992
C  2.443414 -0.773223 0.098345
C  1.749162 1.374448 -0.294302
C  -4.770516 -0.375084 0.355943
C  -3.823863 1.837273 -0.109599
C  -4.944809 1.0059 0.098115
C  2.111758 2.830169 -0.623952
C  3.608841 -1.762132 0.225994
C  -4.252682 -3.198643 0.863924
H  -1.143135 -1.743723 0.46731
H  -1.640557 1.94141 -0.224241
H  -5.642424 -1.015704 0.516102
H  -3.961291 2.904686 -0.308858
H  -5.956569 1.422914 0.061372
H  -4.909827 -3.246932 -0.024644
H  -4.843062 -2.917076 1.756087
H  -3.771552 -4.173634 1.026677
