program: Gaussian 09
title: 000005501
version: EM64L-G09RevD.01
frameworkgroup: C1[X(C11H12N4O2)]
method: RPBEPBE
basis: SDD
operation: Freq
keyword: #p
keyword: freq=noraman
keyword: PBEPBE/SDD
title: #p freq=noraman PBEPBE/SDD
converged: YES YES NO NO
title: Mulliken charges:
elementType: O O N N N N C C C C C C C C C C C H H H H H H H H H H H H
charge: -0.280937 -0.328968 -0.364977 -0.231983 -0.300006 -0.040591 0.212844 0.339262 0.177313 -0.344251 -0.376674 -0.240002 -0.480335 -0.223191 -0.222845 0.303464 -0.671000 0.220681 0.241865 0.237100 0.253020 0.237018 0.355050 0.392443 0.229351 0.229431 0.211890 0.232484 0.232544
chargesum: 0.00000
title: Mulliken charges with hydrogens summed into heavy atoms:
elementType: O O N N N N C C C C C C C C C C C
charge: -0.280937 -0.328968 -0.009927 -0.231983 0.092437 -0.040591 0.212844 0.339262 0.177313 -0.123570 -0.134809 -0.002902 -0.227315 0.013827 0.235937 0.303464 0.005917
polarizability: 2.78481536e+02 8.68765107e-02 1.69791498e+02 1.66654803e-02 -2.00410751e-02 7.09336912e+01
1716.lowfreq: -9.9750 -4.4413 -0.0005 0.0004 0.0005 5.5091 17.3803 35.2401 52.1799
frequency: 13.9899 35.1811 52.1687 71.8554 93.1723 120.5450 142.7694 172.6174 213.6965 221.6614 247.5370 257.6444 269.1516 348.4804 389.4689 398.4277 444.4978 470.2528 481.5192 500.7904 568.8094 578.4813 619.4616 641.9940 662.1073 683.4823 700.4034 747.5154 760.1665 782.9538 792.0134 800.3250 847.2436 852.6906 884.8571 890.2838 959.6655 974.8333 997.6213 1013.9286 1031.1962 1042.4173 1096.2408 1112.8300 1138.5197 1139.0794 1177.6088 1183.6488 1217.8491 1236.9944 1249.2119 1251.8000 1280.8336 1327.0130 1351.7746 1365.9168 1400.1792 1401.6885 1405.5746 1446.8381 1462.5817 1476.4205 1482.9018 1490.6927 1503.4020 1568.8573 1576.5181 1619.2948 1626.6170 2996.8662 3010.6223 3069.6559 3093.7436 3109.2067 3127.0392 3133.5133 3142.9642 3149.7043 3167.9402 3440.6280 3552.0966
redmass: 2.4676 3.6674 4.9005 5.9875 3.8344 4.5935 4.8180 6.0074 6.7346 5.2840 1.1847 6.0237 6.5258 3.8771 1.8689 4.5315 1.9023 2.7918 6.8348 7.0890 6.2835 3.5894 7.3347 2.0161 4.7590 6.8131 1.9300 5.6446 1.3897 3.1426 7.6269 1.0944 3.8679 1.2981 1.5926 4.5369 1.3958 5.2326 1.3477 3.9575 2.4689 2.7481 4.9533 2.2481 1.4553 1.7923 1.2054 2.2696 2.3670 1.8439 1.1330 2.5208 2.2871 1.6611 2.4684 1.4493 1.4950 1.7787 5.3992 2.8164 1.0401 1.0888 2.2455 1.2545 3.4741 4.6306 4.5496 6.4571 10.7596 1.0359 1.0580 1.1071 1.0985 1.1027 1.0865 1.0887 1.0916 1.0948 1.1005 1.0805 1.0793
irintensity: 0.4109 1.0682 4.8514 2.1308 0.1314 7.5989 3.8754 0.9831 1.3352 1.3363 0.8887 31.4872 0.3879 7.5376 33.6909 2.2301 48.0950 24.0581 8.3845 6.8455 14.8180 9.0839 2.0660 61.3320 85.9290 14.0536 31.2798 1.3958 62.6395 6.0420 14.6545 4.6655 27.6149 15.8879 14.3994 1.7956 3.1806 54.9904 0.1617 1.2638 84.8033 127.6989 113.2735 3.1281 4.9843 134.3348 6.0545 81.4336 15.2327 182.6120 0.0359 108.5091 38.6297 249.0289 53.8766 3.7501 77.3344 7.9711 26.9472 536.6599 12.0516 13.8839 140.1487 75.1366 58.9321 9.0131 157.9497 12.4481 300.9398 21.4950 28.7202 9.3944 31.2128 44.4811 2.8348 0.8379 5.3832 24.4032 24.8632 121.8316 191.4288
temp: 298.150 k
press: 1.00000 atm
elementType: 8 8 7 7 7 7 6 6 6 6 6 6 6 6 6 6 6 1 1 1 1 1 1 1 1 1 1 1 1
symmnumber: 1
zpe: 582358.5 jmol-1
zpe.correction: 0.221809 hartree
zpe.thermalcorrener: 0.237392 hartree
zpe.thermalcorrenthalpy: 0.238336 hartree
zpe.thermalcorrgfe: 0.176569 hartree
zpe.sumelectzpe: -794.556482 hartree
zpe.sumelectthermal: -794.540899 hartree
zpe.sumelectthermalent: -794.539955 hartree
zpe.sumelectthermalfe: -794.601722 hartree
dipole: 1.4856 -3.0473 0.0087
dipole: 3.3902
quadrupole: -63.9601 -107.3112 -102.1625
quadrupole: -7.0151 -0.0221 -0.0061
quadrupole: 27.1845 -16.1666 -11.0179 -7.0151 -0.0221 -0.0061
hfenergy: -794.7782908 hartree
pointgroup: C01 [X(C11H12N4O2)]
dipole: -0.6059817 1.1879501 -0.0242688 debye
polarizability: 278.3690323|1.9305323|169.7225317|-3.9707647|-3.2645006|71.1151617 unknown
InChI: InChI=1S/C11H12N4O2/c1-2-17-11(16)15-14-10-9-6-4-3-5-8(9)7-12-13-10/h3-7,14-15H,2H2,1H3
charge 0 multiplicity 1
29 atoms
O  4.069396 -0.176676 -0.108123
O  2.869038 1.870616 -0.149998
N  0.552393 0.449694 -0.060483
N  -0.316625 -1.682274 0.027155
N  1.800257 -0.189067 -0.064825
N  -1.37031 -2.5860 0.076884
C  -1.908147 0.238403 -0.0058
C  -2.981024 -0.717852 0.045216
C  -0.573154 -0.333942 -0.012663
C  -2.204886 1.632061 -0.045321
C  -4.330852 -0.252777 0.055006
C  -3.538434 2.065832 -0.034692
C  -2.634079 -2.117881 0.08483
C  -4.605285 1.120005 0.015531
C  5.351985 0.589149 -0.154677
C  2.917329 0.604577 -0.110618
C  6.472546 -0.444355 -0.136452
H  -1.402283 2.377633 -0.084171
H  -5.146165 -0.984154 0.093896
H  -3.764451 3.136934 -0.06509
H  -3.413344 -2.886349 0.124909
H  -5.641556 1.47451 0.023064
H  0.604441 1.469661 -0.092879
H  1.734691 -1.215785 -0.028013
H  5.35754 1.204306 -1.07257
H  5.385727 1.266409 0.717776
H  7.451426 0.067796 -0.16979
H  6.43063 -1.055516 0.781152
H  6.402495 -1.117958 -1.007454
