program: Gaussian 09
title: 000005639
version: EM64L-G09RevD.01
frameworkgroup: C1[X(C20H29N5O3)]
method: RPBEPBE
basis: SDD
operation: Freq
keyword: #p
keyword: freq=noraman
keyword: PBEPBE/SDD
title: #p freq=noraman PBEPBE/SDD
converged: NO YES NO NO
title: Mulliken charges:
elementType: O O O N N N N N C C C C C C C C C C C C C C C C C C C C H H H H H H H H H H H H H H H H H H H H H H H H H H H H H
charge: -0.297588 -0.287719 -0.284993 -0.089410 -0.167180 -0.427387 -0.237067 -0.207380 -0.367948 -0.367422 -0.390819 -0.416521 -0.342810 -0.503703 0.323798 -0.319565 0.211146 -0.349388 0.462523 -0.344288 -0.259670 -0.260463 -0.435440 0.227119 0.204346 -0.675015 -0.537202 -0.603841 0.201333 0.199740 0.208182 0.188637 0.203800 0.251751 0.223618 0.204237 0.196455 0.208216 0.224833 0.211886 0.221897 0.263535 0.245943 0.333957 0.234934 0.222045 0.223600 0.267389 0.234754 0.229801 0.301029 0.219650 0.225565 0.238772 0.242745 0.242933 0.272650
chargesum: 0.00000
title: Mulliken charges with hydrogens summed into heavy atoms:
elementType: O O O N N N N N C C C C C C C C C C C C C C C C C C C C
charge: -0.297588 -0.287719 -0.284993 -0.089410 -0.167180 -0.093430 -0.237067 -0.207380 0.033126 0.029397 0.064732 0.011334 0.061861 -0.066985 0.323798 0.165866 0.211146 -0.103445 0.462523 -0.109353 -0.037624 -0.036862 -0.168051 0.227119 0.204346 0.090569 0.146785 0.154487
polarizability: 3.26242679e+02 -2.00076255e+01 2.72563653e+02 9.96915488e-01 -2.80068974e+01 2.15589012e+02
1716.lowfreq: -10.2876 -3.9834 -1.4722 -0.0012 -0.0009 -0.0004 9.6528 12.4800 16.9108
frequency: 7.3957 11.4473 15.4709 36.5492 42.5186 63.5251 76.6069 83.9825 95.5243 110.4837 115.0478 123.7581 135.8840 143.9120 177.1421 179.6798 209.2937 209.6546 221.3779 223.9828 243.0376 255.9425 258.4533 268.8252 284.7258 298.5974 301.5308 322.7187 326.9813 329.2542 345.3700 376.2976 389.7926 397.5510 405.3460 465.1587 468.9234 477.6419 486.7203 504.2880 520.1747 546.8786 559.4383 568.3807 619.0704 629.2815 642.9947 671.8790 678.6538 701.4349 721.0009 723.0542 726.0230 737.1275 742.7666 770.2401 776.8851 814.5466 830.1287 850.8884 884.0801 891.1081 903.2801 918.6007 948.9648 956.6457 963.4948 970.4442 985.5434 1027.6102 1040.4258 1051.7139 1054.9604 1060.0549 1081.7991 1089.6752 1096.0419 1109.2170 1111.5741 1117.9450 1122.8224 1131.2671 1140.2960 1149.8655 1154.8795 1173.3274 1176.6480 1181.4077 1189.5651 1201.0004 1202.8030 1221.2222 1234.5909 1239.7416 1248.7524 1253.5927 1271.7538 1280.1781 1281.2056 1293.6862 1298.7718 1311.7690 1338.5566 1341.4738 1347.7880 1353.6083 1359.3690 1366.7424 1375.5910 1380.8430 1389.0663 1392.3948 1421.4873 1430.5256 1434.8521 1443.2270 1452.7067 1455.7573 1458.6686 1464.0948 1466.0514 1473.1938 1475.2345 1475.9021 1476.5019 1477.9410 1482.1984 1500.5022 1502.8001 1503.4342 1530.3561 1569.3109 1584.0169 1605.2620 1631.8024 1651.2896 2844.3216 2860.6968 2872.9565 2898.6884 2913.1468 2956.9934 2958.1669 2970.3190 2976.6640 3003.7202 3006.9969 3022.6398 3026.9302 3037.1255 3045.8022 3046.2961 3052.7190 3052.7577 3098.2502 3105.8105 3112.5512 3118.6329 3130.6892 3133.0849 3145.6669 3158.2998 3170.8119 3224.0151 3584.1469
redmass: 5.0856 5.8521 4.7554 4.5957 4.8594 3.1146 4.2023 3.7443 3.4844 3.3298 3.3024 1.1311 4.2749 2.8026 2.7732 1.9108 2.1129 3.9055 2.6658 2.2139 1.8856 2.1211 3.7925 2.0046 2.7316 2.4919 3.1318 2.9493 2.4334 1.6124 3.4143 3.5382 2.8918 3.5115 4.4943 3.4484 5.4710 3.0107 4.6969 6.8771 4.4276 3.2005 4.1242 3.9116 3.1015 5.4254 4.2397 3.4793 4.3396 3.6657 5.2367 6.0759 3.7881 2.2401 1.3283 5.0071 2.0758 1.4551 1.4776 1.5369 2.7278 1.7703 1.3987 3.7593 2.2640 1.3812 2.1535 2.2242 8.3697 2.4258 3.4515 1.8488 2.0681 2.2228 2.1148 2.7017 2.3303 2.5889 1.2660 1.9767 1.2933 1.3054 2.8042 1.8879 1.8212 1.4323 1.2630 2.1705 3.7488 1.3880 1.8058 1.7253 1.7568 2.2575 2.0018 1.8303 1.3880 1.2785 2.1591 1.4151 1.3368 1.3629 1.3679 2.7556 1.3545 1.8225 1.6613 1.4482 1.6183 1.8480 3.3411 1.3965 1.3207 1.4777 1.2567 1.5246 1.0872 1.1644 1.0957 1.1041 1.0507 1.0869 1.0849 1.0956 1.0663 1.0523 1.1001 1.0868 1.0483 2.5894 2.5490 8.5731 6.5656 6.4534 8.8714 7.7464 1.0707 1.0706 1.0691 1.0690 1.0712 1.0655 1.0327 1.0363 1.0604 1.0899 1.0327 1.0937 1.0897 1.0902 1.1037 1.1008 1.0977 1.0958 1.1022 1.0897 1.0960 1.0995 1.0846 1.1020 1.0891 1.0931 1.0997 1.0922 1.0766
irintensity: 1.3881 0.0406 0.2062 0.3577 0.2435 0.5949 2.3850 2.1790 5.3496 0.2147 9.2467 0.2750 4.1667 0.1981 2.3452 4.5213 11.8652 2.1928 0.4637 2.7490 1.4740 4.0340 1.3013 0.8818 32.8080 1.0583 2.9593 7.4745 13.4563 43.3921 0.4474 5.6735 6.0340 12.6850 15.1112 5.2537 6.9801 1.2989 8.6733 14.2652 5.4775 6.0087 3.3755 4.4929 2.7297 8.6329 0.8921 3.0076 6.5716 10.7600 1.7524 7.9430 1.9813 9.3011 107.8478 2.9849 54.3199 1.0681 0.1471 1.0125 9.9309 5.9010 2.9060 13.7912 35.5307 9.5655 45.7103 13.1432 57.7043 46.6292 5.7679 10.3211 8.6099 11.3046 5.9769 4.2621 3.7131 24.8531 0.6096 28.9487 0.0992 0.1149 63.8603 8.9794 23.4837 9.2648 1.5878 17.8952 34.7295 35.5423 81.6108 16.4957 39.0080 141.8357 17.4823 42.5715 23.6639 0.8064 63.7798 15.9512 35.9048 10.2184 12.0239 103.0759 0.7177 18.4668 4.2368 15.9972 6.3150 48.2794 9.1984 0.3427 103.4852 6.0916 80.5970 23.9297 2.9968 15.6340 27.2957 20.1943 11.5309 49.7990 43.0253 9.7717 11.6163 13.1216 68.6605 43.0372 21.1561 150.4747 428.6217 273.7966 8.1491 76.1522 134.4905 855.9482 60.2678 77.0755 107.2768 69.7033 135.9832 20.8400 73.3042 47.1849 45.8275 8.6070 38.2344 1.2694 52.2857 64.6326 36.3072 72.1457 22.1914 39.6537 21.4875 6.5702 1.9306 21.7258 2.2694 0.8155 16.6565 32.0791 15.8488 2.5892 45.6017
temp: 298.150 k
press: 1.00000 atm
elementType: 8 8 8 7 7 7 7 7 6 6 6 6 6 6 6 6 6 6 6 6 6 6 6 6 6 6 6 6 1 1 1 1 1 1 1 1 1 1 1 1 1 1 1 1 1 1 1 1 1 1 1 1 1 1 1 1 1
symmnumber: 1
zpe: 1247017.3 jmol-1
zpe.correction: 0.474964 hartree
zpe.thermalcorrener: 0.503050 hartree
zpe.thermalcorrenthalpy: 0.503994 hartree
zpe.thermalcorrgfe: 0.412768 hartree
zpe.sumelectzpe: -1276.825269 hartree
zpe.sumelectthermal: -1276.797182 hartree
zpe.sumelectthermalent: -1276.796238 hartree
zpe.sumelectthermalfe: -1276.887464 hartree
dipole: -4.9466 -7.4957 0.9040
dipole: 9.0261
quadrupole: -192.8841 -166.5569 -158.3846
quadrupole: -19.0405 -11.7611 0.4307
quadrupole: -20.2756 6.0517 14.2239 -19.0405 -11.7611 0.4307
hfenergy: -1277.3002324 hartree
pointgroup: C01 [X(C20H29N5O3)]
dipole: 1.944178 -2.8826068 -0.7221179 debye
polarizability: 326.2704035|19.6678496|264.6680461|3.554764|34.218178|223.4568952 unknown
InChI: InChI=1S/C20H29N5O3/c1-22-18(15-19(26)23(2)20(22)27)21-9-6-10-24-11-13-25(14-12-24)16-7-4-5-8-17(16)28-3/h4-5,7-8,15,21H,6,9-14H2,1-3H3
charge 0 multiplicity 1
57 atoms
O  5.100657 -0.599771 -1.787973
O  -7.313016 0.171871 -1.506779
O  -4.675087 2.920013 1.235164
N  1.100097 -1.578286 1.045937
N  3.573954 -0.164653 0.508622
N  -3.159524 -1.508384 -0.02002
N  -5.244571 -0.649113 -0.760432
N  -5.999033 1.540366 -0.141178
C  1.688691 -1.5504 -0.318942
C  2.175727 -1.476334 2.064341
C  2.516879 -0.273656 -0.526587
C  3.009888 -0.196445 1.871146
C  0.238175 -2.761801 1.282782
C  -1.072088 -2.739048 0.466773
C  4.719732 0.634589 0.258107
C  -1.887399 -1.458501 0.71923
C  5.526727 0.4271 -0.916009
C  5.16276 1.623242 1.180058
C  -4.061479 -0.464574 -0.020388
C  6.686789 1.19702 -1.143344
C  6.338789 2.375979 0.962345
C  7.100498 2.172306 -0.204469
C  -3.844287 0.72986 0.663067
C  -6.253029 0.359439 -0.837253
C  -4.801712 1.804973 0.639755
C  -5.498284 -1.895289 -1.505174
C  5.960163 -0.92009 -2.928246
C  -7.038093 2.589648 -0.215986
H  2.344097 -2.44041 -0.494316
H  0.87511 -1.568251 -1.066765
H  1.71121 -1.45547 3.068268
H  2.865713 -2.356994 2.018034
H  1.837945 0.608922 -0.470713
H  2.987627 -0.2994 -1.519395
H  3.833764 -0.199721 2.606326
H  2.363623 0.690918 2.072389
H  0.780047 -3.718542 1.064658
H  -0.015278 -2.776469 2.36111
H  -0.857436 -2.835916 -0.615604
H  -1.666629 -3.629562 0.757131
H  -2.080192 -1.345434 1.807077
H  -1.296165 -0.578155 0.406109
H  4.56522 1.82225 2.07484
H  -3.404926 -2.38472 -0.477402
H  7.289473 1.030563 -2.041381
H  6.642831 3.128067 1.698351
H  8.007146 2.757164 -0.391067
H  -2.940261 0.890612 1.247007
H  -4.721732 -2.066689 -2.273874
H  -5.560099 -2.766515 -0.825385
H  -6.471272 -1.774125 -2.00468
H  6.03485 -0.069959 -3.634429
H  6.974562 -1.214147 -2.59558
H  5.471016 -1.771287 -3.425238
H  -7.186575 2.907191 -1.261531
H  -7.996803 2.205077 0.169478
H  -6.682591 3.431341 0.396631
