program: Gaussian 09
title: 000005511
version: EM64L-G09RevD.01
frameworkgroup: C1[X(C16H23NO)]
method: RPBEPBE
basis: SDD
operation: Freq
keyword: #p
keyword: freq=noraman
keyword: PBEPBE/SDD
title: #p freq=noraman PBEPBE/SDD
converged: YES YES NO NO
title: Mulliken charges:
elementType: O N C C C C C C C C C C C C C C C C H H H H H H H H H H H H H H H H H H H H H H H
charge: -0.217982 -0.074980 -0.367025 -0.348168 -0.389976 -0.398192 -0.398405 -0.377780 -0.182537 -0.732951 0.092467 0.309258 -0.352583 -0.359150 -0.435203 -0.363434 0.440457 -0.806150 0.216523 0.168533 0.170630 0.197327 0.204874 0.193109 0.191074 0.205952 0.215308 0.188973 0.212899 0.222913 0.214341 0.235178 0.211459 0.239502 0.233337 0.277197 0.232452 0.233708 0.231733 0.226777 0.238533
chargesum: 0.00000
title: Mulliken charges with hydrogens summed into heavy atoms:
elementType: O N C C C C C C C C C C C C C C C C
charge: -0.217982 -0.074980 0.018032 0.019789 0.008008 -0.001167 0.005876 0.058032 0.031805 -0.046812 0.092467 0.309258 -0.119246 -0.081952 -0.202750 -0.129726 0.440457 -0.109107
polarizability: 2.40573826e+02 1.60967284e+01 1.90157635e+02 9.22618722e+00 -8.46613674e+00 1.25680417e+02
1716.lowfreq: -13.0697 -4.8074 -0.0007 -0.0006 0.0003 3.5231 12.1063 21.0717 23.8260
frequency: -11.1389 20.7040 23.6848 43.3201 51.9970 91.9453 105.2839 124.0315 166.1263 189.7055 199.5071 229.9509 259.4696 279.8315 299.8579 308.8050 342.9187 349.5562 379.4615 405.5339 406.0665 435.0819 447.2005 482.2286 503.4047 546.2245 594.2612 634.4795 681.4355 721.9733 735.7842 776.0627 800.8229 804.3377 831.7886 850.7440 855.0437 864.0021 873.9688 888.7127 932.5344 956.7322 961.0032 965.3974 988.7684 995.8258 1002.0047 1012.5312 1042.1495 1046.7696 1047.7957 1069.8079 1100.1839 1107.7877 1119.4772 1122.8301 1129.4954 1149.7173 1155.8010 1186.3172 1199.1485 1221.5902 1232.5624 1257.3016 1262.7857 1268.4896 1284.7162 1291.1476 1308.0079 1324.2626 1334.6798 1339.9682 1345.0044 1349.8700 1359.4693 1371.7224 1373.4772 1386.8769 1395.9529 1410.2139 1450.8254 1459.7695 1460.3450 1463.8858 1468.0223 1469.7845 1472.1643 1473.1030 1477.0348 1481.3501 1500.1768 1557.6256 1589.2909 1620.6657 2811.6210 2826.1195 2862.8450 2965.8754 2977.4487 2985.1358 2986.2978 2989.9217 2997.7733 3018.7313 3025.7120 3030.2526 3035.3646 3046.2896 3055.1578 3057.2935 3087.8685 3087.8786 3101.5587 3123.1962 3125.1450 3153.0012 3157.9662
redmass: 1.0347 3.3180 3.7970 3.4737 3.6824 4.3262 3.1598 4.2737 3.9334 2.5747 1.0738 1.8351 3.6724 3.2650 3.5000 2.6735 2.5540 3.2859 1.8859 2.8445 2.7451 3.7588 2.8240 2.7351 3.2119 1.8926 4.8154 6.8979 4.0038 3.3358 2.9473 3.2786 1.7880 2.6883 1.7307 1.5671 2.0729 1.4353 2.3027 1.9511 1.5674 1.3074 3.2226 1.4008 1.4632 2.4792 1.3667 2.7092 1.7419 1.5863 2.0366 1.5179 2.0192 2.5215 2.3919 1.3140 1.7892 1.3667 2.3624 1.3053 1.3542 3.5171 2.1358 1.2763 1.2441 1.5593 1.3043 1.4473 1.3110 1.2734 1.3758 1.4287 1.5707 1.4768 1.4099 2.9179 1.4400 1.3618 1.2440 3.6324 1.0908 1.0827 1.0867 1.0852 1.0658 1.0846 1.0955 1.0567 1.0655 1.0875 2.5992 6.6202 7.3232 6.4766 1.0714 1.0703 1.0694 1.0630 1.0379 1.0619 1.0610 1.0376 1.0791 1.0855 1.0902 1.0892 1.0942 1.1034 1.1036 1.0961 1.0994 1.0994 1.1006 1.0888 1.0886 1.0941 1.0957
irintensity: 0.5976 0.3872 0.3553 0.0292 1.3471 0.3166 0.3640 1.4503 2.1509 1.5889 0.2385 0.3046 1.1267 1.7350 4.6742 4.2624 0.8442 6.5894 4.6678 0.4765 1.3342 0.6716 0.5021 17.8586 3.6302 0.8147 7.3930 0.3539 3.8225 6.4437 4.0034 12.5292 0.5547 4.4401 32.9259 5.8537 6.0828 9.9776 0.4734 0.6997 4.3600 4.8393 96.2495 3.2646 25.9867 27.4815 3.6258 1.6217 10.5844 17.1725 8.1896 20.5639 34.6209 4.4326 8.8209 16.9310 4.8027 3.6316 43.7507 33.4539 9.5827 39.8614 92.9523 2.1624 15.5570 43.7560 25.4073 10.9404 3.2264 6.3413 4.2293 0.4830 41.8486 5.9548 0.6035 2.4909 29.7284 13.3617 15.4536 14.4149 7.6080 6.5039 13.3453 13.5446 13.2700 1.1428 15.1596 10.5623 9.2582 17.0387 0.0270 96.7066 65.9512 46.5737 53.7690 109.2162 125.4024 38.1696 28.8573 30.4011 35.5540 35.7033 4.0023 70.1894 17.7491 74.2924 41.3948 19.8014 89.9113 19.6599 17.9857 29.5839 11.7311 12.9346 19.5728 22.9784 2.5064
temp: 298.150 k
press: 1.00000 atm
elementType: 8 7 6 6 6 6 6 6 6 6 6 6 6 6 6 6 6 6 1 1 1 1 1 1 1 1 1 1 1 1 1 1 1 1 1 1 1 1 1 1 1
symmnumber: 1
zpe: 929905.1 jmol-1
zpe.correction: 0.354182 hartree
zpe.thermalcorrener: 0.371682 hartree
zpe.thermalcorrenthalpy: 0.372626 hartree
zpe.thermalcorrgfe: 0.306956 hartree
zpe.sumelectzpe: -752.096949 hartree
zpe.sumelectthermal: -752.079449 hartree
zpe.sumelectthermalent: -752.078505 hartree
zpe.sumelectthermalfe: -752.144176 hartree
dipole: -0.3286 -4.2687 -0.0041
dipole: 4.2813
quadrupole: -93.7699 -116.1277 -110.1619
quadrupole: 6.0095 -0.4820 -1.0483
quadrupole: 12.9166 -9.4412 -3.4754 6.0095 -0.4820 -1.0483
hfenergy: -752.4511315 hartree
pointgroup: C01 [X(C16H23N1O1)]
dipole: 0.0939551 1.6023003 0.5108708 debye
polarizability: 240.0476083|18.7722358|179.9212927|-2.7028092|25.8113211|136.4429766 unknown
InChI: InChI=1S/C16H23NO/c1-13-6-8-15(9-7-13)16(18)14(2)12-17-10-4-3-5-11-17/h6-9,14H,3-5,10-12H2,1-2H3
charge 0 multiplicity 1
41 atoms
O  1.196569 -2.589213 -1.164514
N  -2.603071 -0.062846 -0.302073
C  -3.581692 0.272368 -1.369249
C  -2.519462 1.013179 0.716466
C  -4.987241 0.50535 -0.778359
C  -3.891387 1.274624 1.370954
C  -4.952754 1.612829 0.299859
C  -1.278585 -0.44611 -0.840439
C  -0.485921 -1.38922 0.130427
C  -1.222176 -2.730416 0.310053
C  0.931276 -1.584525 -0.436443
C  1.994242 -0.555302 -0.160092
C  1.766095 0.620159 0.604164
C  3.293528 -0.766388 -0.700502
C  2.805535 1.549357 0.82142
C  4.326164 0.160317 -0.478877
C  4.1029 1.336687 0.289359
C  5.22736 2.323779 0.541011
H  -3.607199 -0.56602 -2.089734
H  -3.267901 1.190284 -1.935249
H  -2.142703 1.967104 0.255925
H  -1.790376 0.714476 1.493038
H  -5.342282 -0.44053 -0.325484
H  -5.687879 0.773006 -1.592653
H  -3.797801 2.099602 2.103482
H  -4.199776 0.36679 1.92451
H  -5.949281 1.733298 0.765144
H  -4.698573 2.582522 -0.176977
H  -0.660768 0.453899 -1.086432
H  -1.433981 -1.000108 -1.785602
H  -0.411705 -0.884633 1.112941
H  -1.162601 -3.326201 -0.617007
H  -0.771636 -3.329647 1.121563
H  -2.280481 -2.532122 0.551086
H  0.778965 0.821546 1.032779
H  3.458535 -1.672303 -1.293436
H  2.609776 2.452181 1.412221
H  5.321066 -0.022126 -0.903477
H  5.777956 2.552636 -0.389587
H  4.850207 3.27296 0.958268
H  5.962756 1.911555 1.258712
